{"text_format":"1","workbook":"xlsx","n_sheets":19,"sheets":["Admin","Start","Home","Results","About you ","Leadership and team management","Resources management","Professionalism","Project delivery","Communication management","Conflict management","Planning for success","Scope management","Risk and issue management","Project finances","Project structure & governance","Quality","Glossary","Reference"],"not_rendered":{"charts":3,"images":20,"macros":1,"external_links":1,"defined_names":19,"comments":0,"pivot_tables":0},"unopened":[],"bounds":{"document_bytes":16777216,"sheet_cells":100000,"rows_first":2000,"rows_last":500,"rows_between":2000,"halvings":0,"cell_chars":16384,"cell_head_chars":4096},"cells_cut":0,"cells_raw":0,"read":"whole","date_system":"1900"}

{"sheet":"Admin","index":0,"n_rows":331,"n_cols":101,"rows_kept":331,"cut":false,"hidden":true,"merged":[[31,37,31,76],[1,37,1,76],[1,78,1,99],[1,19,1,29],[1,31,1,35],[17,31,17,32]]}
["Leadership and team management ","Raw Output","Score",null,null,null,{"$f":"_xlfn.CONCAT($M$6,A1,$M$5,B2,$M$5,B3,$M$5,B4,$M$5,B5,$M$5,B6,$M$5,B7,$M$5,B8,$M$7)","v":"[Leadership and team management _1_1_1_1_1_1_1]"}]
["Importance ",1,{"$f":"IF(B2=1,1,B2-1)","v":1},{"$f":"SUM(B2:B8)","v":7},{"$f":"IF(D2=7,\"Not started\",\"In progress\")","v":"Not started"},null,null,null,null,null,null,null,"Current State: ","Admin/Edit/Results",null,null,null,null,null,"Raw Results",null,null,null,null,null,null,null,null,null,null,null,"Weighted Results",null,null,null,null,null,"Rank Duplication calculator",null,null,null,null,null,null,null,null,null,null,null,null,null,null,null,null,null,null,null,null,null,null,null,null,null,null,null,null,null,null,null,null,null,null,null,null,null,null,null,null,"Sorted Results"]
["Level 1 - Knowledge",1,{"$f":"IF(B3<3,0,B3-2)","v":0},null,null,null,null,null,null,null,null,null,"IG ","Checked/Unchecked",null,null,null,null,null,"Summary","K1","K2","K3","E1","E2","E3","Importance","graph (I)","K(Raw)","E(Raw)",null,"K(total)","E(total)","I(w)","Score","Rank",null,1,2,3,4,5,6,7,8,9,10,11,12,null,1,2,3,4,5,6,7,8,9,10,11,12,null,1,2,3,4,5,6,7,8,9,10,11,12,null," Result",null,"Rank","Comp","K1","K2","K3","E1","E2","E3","I","Ktotal","Etotal","Iw","Score","Lv1 ","Lv2","Lv3","Remaining","Level 1","Level 2","Level 3","Remaining %","Total","calculated CF Score"]
["Level 1 - Experience ",1,0,null,null,null,null,null,null,null,null,null,null,null,null,null,null,null,null,"Leadership and Team Management ",{"$f":"C3","v":0},{"$f":"C5","v":0},{"$f":"C7","v":0},{"$f":"C4","v":0},{"$f":"C6","v":0},{"$f":"C8","v":0},{"$f":"C2","v":1},{"$f":"AA4+1","v":2},{"$f":"(U4+V4+W4)","v":0},{"$f":"(X4+Y4+Z4)","v":0},null,{"$f":"(U4*$AG$19)+(V4*$AG$20)+(W4*$AG$21)","v":0},{"$f":"(X4*$AG$22)+(Y4*$AG$23)+(Z4*$AG$24)","v":0},{"$f":"($AG$25*AA4)","v":6},{"$f":"SUM(AF4:AH4)","v":6},{"$f":"RANK(AI4,$AI$4:$AI$15,1)","v":1},null,{"$f":"IF($AJ4=AL$3,1,0)","v":1},{"$f":"IF($AJ4=AM$3,1,0)","v":0},0,0,0,0,0,0,0,0,0,0,null,{"$f":"IF(AL4=0,0,SUM(AL$4:AL4))","v":1},{"$f":"IF(AM4=0,0,SUM(AM$4:AM4))","v":0},{"$f":"IF(AN4=0,0,SUM(AN$4:AN4))","v":0},{"$f":"IF(AO4=0,0,SUM(AO$4:AO4))","v":0},{"$f":"IF(AP4=0,0,SUM(AP$4:AP4))","v":0},{"$f":"IF(AQ4=0,0,SUM(AQ$4:AQ4))","v":0},{"$f":"IF(AR4=0,0,SUM(AR$4:AR4))","v":0},{"$f":"IF(AS4=0,0,SUM(AS$4:AS4))","v":0},{"$f":"IF(AT4=0,0,SUM(AT$4:AT4))","v":0},{"$f":"IF(AU4=0,0,SUM(AU$4:AU4))","v":0},{"$f":"IF(AV4=0,0,SUM(AV$4:AV4))","v":0},{"$f":"IF(AW4=0,0,SUM(AW$4:AW4))","v":0},null,{"$f":"IF(AY4=0,0,AX$17+AY4)","v":1},{"$f":"IF(AZ4=0,0,AY$17+AZ4)","v":0},0,0,0,0,0,0,0,0,0,0,null,{"$f":"SUM(BL4:BW4)","v":1},null,1,{"$f":"INDEX($T$4:$AJ$15,MATCH($CA4,$BY$4:$BY$15,0),1)","v":"Leadership and Team Management "},{"$f":"INDEX($T$4:$AJ$15,MATCH($CA4,$BY$4:$BY$15,0),2)","v":0},{"$f":"INDEX($T$4:$AJ$15,MATCH($CA4,$BY$4:$BY$15,0),3)","v":0},{"$f":"INDEX($T$4:$AJ$15,MATCH($CA4,$BY$4:$BY$15,0),4)","v":0},{"$f":"INDEX($T$4:$AJ$15,MATCH($CA4,$BY$4:$BY$15,0),5)","v":0},{"$f":"INDEX($T$4:$AJ$15,MATCH($CA4,$BY$4:$BY$15,0),6)","v":0},{"$f":"INDEX($T$4:$AJ$15,MATCH($CA4,$BY$4:$BY$15,0),7)","v":0},{"$f":"INDEX($T$4:$AJ$15,MATCH($CA4,$BY$4:$BY$15,0),8)","v":1},{"$f":"INDEX($T$4:$AJ$15,MATCH($CA4,$BY$4:$BY$15,0),13)","v":0},{"$f":"INDEX($T$4:$AJ$15,MATCH($CA4,$BY$4:$BY$15,0),14)","v":0},{"$f":"INDEX($T$4:$AJ$15,MATCH($CA4,$BY$4:$BY$15,0),15)","v":6},{"$f":"INDEX($T$4:$AJ$15,MATCH($CA4,$BY$4:$BY$15,0),16)","v":6},{"$f":"CC4*CF4","v":0},{"$f":"CD4*CG4","v":0},{"$f":"CE4*CH4","v":0},{"$f":"75-SUM(CN4:CP4)","v":75},{"$f":"CN4/25","v":0},{"$f":"CO4/25","v":0},0,{"$f":"CQ4/75","v":1},{"$f":"(SUM(CN4:CP4)/75)*100","v":0},{"$f":"CM4*(100/75)","v":8}]
["Level 2 - Knowledge",1,0,null,null,null,null,null,null,null,null,null,"_",null,null,null,null,null,null,"Resources Management",{"$f":"C11","v":0},{"$f":"C13","v":0},{"$f":"C15","v":0},{"$f":"C12","v":0},{"$f":"C14","v":0},{"$f":"C16","v":0},{"$f":"C10","v":1},{"$f":"AA5+1","v":2},0,0,null,0,0,{"$f":"($AG$25*AA5)","v":6},{"$f":"SUM(AF5:AH5)","v":6},{"$f":"RANK(AI5,$AI$4:$AI$15,1)","v":1},null,{"$f":"IF($AJ5=AL$3,1,0)","v":1},0,0,0,0,0,0,0,0,0,0,0,null,{"$f":"IF(AL5=0,0,SUM(AL$4:AL5))","v":2},{"$f":"IF(AM5=0,0,SUM(AM$4:AM5))","v":0},{"$f":"IF(AN5=0,0,SUM(AN$4:AN5))","v":0},{"$f":"IF(AO5=0,0,SUM(AO$4:AO5))","v":0},{"$f":"IF(AP5=0,0,SUM(AP$4:AP5))","v":0},{"$f":"IF(AQ5=0,0,SUM(AQ$4:AQ5))","v":0},{"$f":"IF(AR5=0,0,SUM(AR$4:AR5))","v":0},{"$f":"IF(AS5=0,0,SUM(AS$4:AS5))","v":0},{"$f":"IF(AT5=0,0,SUM(AT$4:AT5))","v":0},{"$f":"IF(AU5=0,0,SUM(AU$4:AU5))","v":0},{"$f":"IF(AV5=0,0,SUM(AV$4:AV5))","v":0},{"$f":"IF(AW5=0,0,SUM(AW$4:AW5))","v":0},null,{"$f":"IF(AY5=0,0,AX$17+AY5)","v":2},{"$f":"IF(AZ5=0,0,AY$17+AZ5)","v":0},{"$f":"IF(BA5=0,0,AZ$17+BA5)","v":0},{"$f":"IF(BB5=0,0,BA$17+BB5)","v":0},{"$f":"IF(BC5=0,0,BB$17+BC5)","v":0},{"$f":"IF(BD5=0,0,BC$17+BD5)","v":0},{"$f":"IF(BE5=0,0,BD$17+BE5)","v":0},{"$f":"IF(BF5=0,0,BE$17+BF5)","v":0},{"$f":"IF(BG5=0,0,BF$17+BG5)","v":0},{"$f":"IF(BH5=0,0,BG$17+BH5)","v":0},{"$f":"IF(BI5=0,0,BH$17+BI5)","v":0},{"$f":"IF(BJ5=0,0,BI$17+BJ5)","v":0},null,2,null,2,{"$f":"INDEX($T$4:$AJ$15,MATCH($CA5,$BY$4:$BY$15,0),1)","v":"Resources Management"},{"$f":"INDEX($T$4:$AJ$15,MATCH($CA5,$BY$4:$BY$15,0),2)","v":0},{"$f":"INDEX($T$4:$AJ$15,MATCH($CA5,$BY$4:$BY$15,0),3)","v":0},{"$f":"INDEX($T$4:$AJ$15,MATCH($CA5,$BY$4:$BY$15,0),4)","v":0},{"$f":"INDEX($T$4:$AJ$15,MATCH($CA5,$BY$4:$BY$15,0),5)","v":0},{"$f":"INDEX($T$4:$AJ$15,MATCH($CA5,$BY$4:$BY$15,0),6)","v":0},{"$f":"INDEX($T$4:$AJ$15,MATCH($CA5,$BY$4:$BY$15,0),7)","v":0},{"$f":"INDEX($T$4:$AJ$15,MATCH($CA5,$BY$4:$BY$15,0),8)","v":1},{"$f":"INDEX($T$4:$AJ$15,MATCH($CA5,$BY$4:$BY$15,0),13)","v":0},{"$f":"INDEX($T$4:$AJ$15,MATCH($CA5,$BY$4:$BY$15,0),14)","v":0},{"$f":"INDEX($T$4:$AJ$15,MATCH($CA5,$BY$4:$BY$15,0),15)","v":6},{"$f":"INDEX($T$4:$AJ$15,MATCH($CA5,$BY$4:$BY$15,0),16)","v":6},{"$f":"CC5*CF5","v":0},{"$f":"CD5*CG5","v":0},{"$f":"CE5*CH5","v":0},{"$f":"75-SUM(CN5:CP5)","v":75},{"$f":"CN5/25","v":0},0,0,{"$f":"CQ5/75","v":1},{"$f":"(SUM(CN5:CP5)/75)*100","v":0},{"$f":"CM5*(100/75)","v":8}]
["Level 2 - Experience",1,0,null,null,null,null,null,null,null,null,null,"[",null,null,null,null,null,null,"Professionalism ",{"$f":"C19","v":0},{"$f":"C21","v":0},{"$f":"C23","v":0},{"$f":"C20","v":0},{"$f":"C22","v":0},{"$f":"C24","v":0},{"$f":"C18","v":1},2,0,0,null,0,0,6,6,1,null,1,0,0,0,0,0,0,0,0,0,0,0,null,{"$f":"IF(AL6=0,0,SUM(AL$4:AL6))","v":3},{"$f":"IF(AM6=0,0,SUM(AM$4:AM6))","v":0},{"$f":"IF(AN6=0,0,SUM(AN$4:AN6))","v":0},{"$f":"IF(AO6=0,0,SUM(AO$4:AO6))","v":0},{"$f":"IF(AP6=0,0,SUM(AP$4:AP6))","v":0},{"$f":"IF(AQ6=0,0,SUM(AQ$4:AQ6))","v":0},{"$f":"IF(AR6=0,0,SUM(AR$4:AR6))","v":0},{"$f":"IF(AS6=0,0,SUM(AS$4:AS6))","v":0},{"$f":"IF(AT6=0,0,SUM(AT$4:AT6))","v":0},{"$f":"IF(AU6=0,0,SUM(AU$4:AU6))","v":0},{"$f":"IF(AV6=0,0,SUM(AV$4:AV6))","v":0},{"$f":"IF(AW6=0,0,SUM(AW$4:AW6))","v":0},null,3,0,0,0,0,0,0,0,0,0,0,0,null,3,null,3,"Professionalism ",0,0,0,0,0,0,1,0,0,6,6,0,0,0,75,0,0,0,1,0,8]
["Level 3  -Knowledge",1,0,null,null,null,null,null,null,null,null,null,"]",null,null,null,null,null,null,"Project Delivery",{"$f":"C27","v":0},{"$f":"C29","v":0},{"$f":"C31","v":0},{"$f":"C28","v":0},{"$f":"C30","v":0},{"$f":"C32","v":0},{"$f":"C26","v":1},2,0,0,null,0,0,6,6,1,null,1,0,0,0,0,0,0,0,0,0,0,0,null,{"$f":"IF(AL7=0,0,SUM(AL$4:AL7))","v":4},{"$f":"IF(AM7=0,0,SUM(AM$4:AM7))","v":0},{"$f":"IF(AN7=0,0,SUM(AN$4:AN7))","v":0},{"$f":"IF(AO7=0,0,SUM(AO$4:AO7))","v":0},{"$f":"IF(AP7=0,0,SUM(AP$4:AP7))","v":0},{"$f":"IF(AQ7=0,0,SUM(AQ$4:AQ7))","v":0},{"$f":"IF(AR7=0,0,SUM(AR$4:AR7))","v":0},{"$f":"IF(AS7=0,0,SUM(AS$4:AS7))","v":0},{"$f":"IF(AT7=0,0,SUM(AT$4:AT7))","v":0},{"$f":"IF(AU7=0,0,SUM(AU$4:AU7))","v":0},{"$f":"IF(AV7=0,0,SUM(AV$4:AV7))","v":0},{"$f":"IF(AW7=0,0,SUM(AW$4:AW7))","v":0},null,4,0,0,0,0,0,0,0,0,0,0,0,null,4,null,4,"Project Delivery",0,0,0,0,0,0,1,0,0,6,6,0,0,0,75,0,0,0,1,0,8]
["Level 3 - Experience",1,0,null,null,null,null,null,null,null,null,null," ",null,null,null,null,null,null,"Communication Management",{"$f":"C35","v":0},{"$f":"C37","v":0},{"$f":"C39","v":0},{"$f":"C36","v":0},{"$f":"C38","v":0},{"$f":"C40","v":0},{"$f":"C34","v":1},2,0,0,null,0,0,6,6,1,null,1,0,0,0,0,0,0,0,0,0,0,0,null,{"$f":"IF(AL8=0,0,SUM(AL$4:AL8))","v":5},{"$f":"IF(AM8=0,0,SUM(AM$4:AM8))","v":0},{"$f":"IF(AN8=0,0,SUM(AN$4:AN8))","v":0},{"$f":"IF(AO8=0,0,SUM(AO$4:AO8))","v":0},{"$f":"IF(AP8=0,0,SUM(AP$4:AP8))","v":0},{"$f":"IF(AQ8=0,0,SUM(AQ$4:AQ8))","v":0},{"$f":"IF(AR8=0,0,SUM(AR$4:AR8))","v":0},{"$f":"IF(AS8=0,0,SUM(AS$4:AS8))","v":0},{"$f":"IF(AT8=0,0,SUM(AT$4:AT8))","v":0},{"$f":"IF(AU8=0,0,SUM(AU$4:AU8))","v":0},{"$f":"IF(AV8=0,0,SUM(AV$4:AV8))","v":0},{"$f":"IF(AW8=0,0,SUM(AW$4:AW8))","v":0},null,5,0,0,0,0,0,0,0,0,0,0,0,null,5,null,5,"Communication Management",0,0,0,0,0,0,1,0,0,6,6,0,0,0,75,0,0,0,1,0,8]
["Resources Management",1,null,null,null,null,{"$f":"_xlfn.CONCAT($M$6,A9,$M$5,B10,$M$5,B11,$M$5,B12,$M$5,B13,$M$5,B14,$M$5,B15,$M$5,B16,$M$7)","v":"[Resources Management_1_1_1_1_1_1_1]"},null,null,null,null,null,null,null,null,null,null,null,null,"Conflict Management",{"$f":"C43","v":0},{"$f":"C37","v":0},{"$f":"C47","v":0},{"$f":"C44","v":0},{"$f":"C46","v":0},{"$f":"C48","v":0},{"$f":"C42","v":1},2,0,0,null,0,0,6,6,1,null,1,0,0,0,0,0,0,0,0,0,0,0,null,{"$f":"IF(AL9=0,0,SUM(AL$4:AL9))","v":6},{"$f":"IF(AM9=0,0,SUM(AM$4:AM9))","v":0},{"$f":"IF(AN9=0,0,SUM(AN$4:AN9))","v":0},{"$f":"IF(AO9=0,0,SUM(AO$4:AO9))","v":0},{"$f":"IF(AP9=0,0,SUM(AP$4:AP9))","v":0},{"$f":"IF(AQ9=0,0,SUM(AQ$4:AQ9))","v":0},{"$f":"IF(AR9=0,0,SUM(AR$4:AR9))","v":0},{"$f":"IF(AS9=0,0,SUM(AS$4:AS9))","v":0},{"$f":"IF(AT9=0,0,SUM(AT$4:AT9))","v":0},{"$f":"IF(AU9=0,0,SUM(AU$4:AU9))","v":0},{"$f":"IF(AV9=0,0,SUM(AV$4:AV9))","v":0},{"$f":"IF(AW9=0,0,SUM(AW$4:AW9))","v":0},null,6,0,0,0,0,0,0,0,0,0,0,0,null,6,null,6,"Conflict Management",0,0,0,0,0,0,1,0,0,6,6,0,0,0,75,0,0,0,1,0,8]
["Importance ",1,{"$f":"IF(B10=1,1,B10-1)","v":1},{"$f":"SUM(B10:B16)","v":7},{"$f":"IF(D10=7,\"Not started\",\"In progress\")","v":"Not started"},null,null,null,null,null,null,null,null,null,null,null,null,null,null,"Planning for success",{"$f":"C51","v":0},{"$f":"C53","v":0},{"$f":"C55","v":0},{"$f":"C52","v":0},{"$f":"C54","v":0},{"$f":"C56","v":0},{"$f":"C50","v":1},2,0,0,null,0,0,6,6,1,null,1,0,0,0,0,0,0,0,0,0,0,0,null,{"$f":"IF(AL10=0,0,SUM(AL$4:AL10))","v":7},{"$f":"IF(AM10=0,0,SUM(AM$4:AM10))","v":0},{"$f":"IF(AN10=0,0,SUM(AN$4:AN10))","v":0},{"$f":"IF(AO10=0,0,SUM(AO$4:AO10))","v":0},{"$f":"IF(AP10=0,0,SUM(AP$4:AP10))","v":0},{"$f":"IF(AQ10=0,0,SUM(AQ$4:AQ10))","v":0},{"$f":"IF(AR10=0,0,SUM(AR$4:AR10))","v":0},{"$f":"IF(AS10=0,0,SUM(AS$4:AS10))","v":0},{"$f":"IF(AT10=0,0,SUM(AT$4:AT10))","v":0},{"$f":"IF(AU10=0,0,SUM(AU$4:AU10))","v":0},{"$f":"IF(AV10=0,0,SUM(AV$4:AV10))","v":0},{"$f":"IF(AW10=0,0,SUM(AW$4:AW10))","v":0},null,7,0,0,0,0,0,0,0,0,0,0,0,null,7,null,7,"Planning for success",0,0,0,0,0,0,1,0,0,6,6,0,0,0,75,0,0,0,1,0,8]
["Level 1 - Knowledge",1,{"$f":"IF(B11<3,0,B11-2)","v":0},null,null,null,null,null,null,null,null,null,null,null,null,null,null,null,null,"Scope Management",{"$f":"C59","v":0},{"$f":"C61","v":0},{"$f":"C63","v":0},{"$f":"C60","v":0},{"$f":"C62","v":0},{"$f":"C64","v":0},{"$f":"C58","v":1},2,0,0,null,0,0,6,6,1,null,1,0,0,0,0,0,0,0,0,0,0,0,null,{"$f":"IF(AL11=0,0,SUM(AL$4:AL11))","v":8},{"$f":"IF(AM11=0,0,SUM(AM$4:AM11))","v":0},{"$f":"IF(AN11=0,0,SUM(AN$4:AN11))","v":0},{"$f":"IF(AO11=0,0,SUM(AO$4:AO11))","v":0},{"$f":"IF(AP11=0,0,SUM(AP$4:AP11))","v":0},{"$f":"IF(AQ11=0,0,SUM(AQ$4:AQ11))","v":0},{"$f":"IF(AR11=0,0,SUM(AR$4:AR11))","v":0},{"$f":"IF(AS11=0,0,SUM(AS$4:AS11))","v":0},{"$f":"IF(AT11=0,0,SUM(AT$4:AT11))","v":0},{"$f":"IF(AU11=0,0,SUM(AU$4:AU11))","v":0},{"$f":"IF(AV11=0,0,SUM(AV$4:AV11))","v":0},{"$f":"IF(AW11=0,0,SUM(AW$4:AW11))","v":0},null,8,0,0,0,0,0,0,0,0,0,0,0,null,8,null,8,"Scope Management",0,0,0,0,0,0,1,0,0,6,6,0,0,0,75,0,0,0,1,0,8]
["Level 1 - Experience ",1,0,null,null,null,null,null,null,null,null,null,null,null,null,null,null,null,null,"Risk and Issue Management",{"$f":"C67","v":0},{"$f":"C69","v":0},{"$f":"C71","v":0},{"$f":"C68","v":0},{"$f":"C70","v":0},{"$f":"C72","v":0},{"$f":"C66","v":1},2,0,0,null,0,0,6,6,1,null,1,0,0,0,0,0,0,0,0,0,0,0,null,{"$f":"IF(AL12=0,0,SUM(AL$4:AL12))","v":9},{"$f":"IF(AM12=0,0,SUM(AM$4:AM12))","v":0},{"$f":"IF(AN12=0,0,SUM(AN$4:AN12))","v":0},{"$f":"IF(AO12=0,0,SUM(AO$4:AO12))","v":0},{"$f":"IF(AP12=0,0,SUM(AP$4:AP12))","v":0},{"$f":"IF(AQ12=0,0,SUM(AQ$4:AQ12))","v":0},{"$f":"IF(AR12=0,0,SUM(AR$4:AR12))","v":0},{"$f":"IF(AS12=0,0,SUM(AS$4:AS12))","v":0},{"$f":"IF(AT12=0,0,SUM(AT$4:AT12))","v":0},{"$f":"IF(AU12=0,0,SUM(AU$4:AU12))","v":0},{"$f":"IF(AV12=0,0,SUM(AV$4:AV12))","v":0},{"$f":"IF(AW12=0,0,SUM(AW$4:AW12))","v":0},null,9,0,0,0,0,0,0,0,0,0,0,0,null,9,null,9,"Risk and Issue Management",0,0,0,0,0,0,1,0,0,6,6,0,0,0,75,0,0,0,1,0,8]
["Level 2 - Knowledge",1,0,null,null,null,null,null,null,null,null,null,null,null,null,null,null,null,null,"Project Finances",{"$f":"C75","v":0},{"$f":"C77","v":0},{"$f":"C79","v":0},{"$f":"C76","v":0},{"$f":"C78","v":0},{"$f":"C80","v":0},{"$f":"C74","v":1},2,0,0,null,0,0,6,6,1,null,1,0,0,0,0,0,0,0,0,0,0,0,null,{"$f":"IF(AL13=0,0,SUM(AL$4:AL13))","v":10},{"$f":"IF(AM13=0,0,SUM(AM$4:AM13))","v":0},{"$f":"IF(AN13=0,0,SUM(AN$4:AN13))","v":0},{"$f":"IF(AO13=0,0,SUM(AO$4:AO13))","v":0},{"$f":"IF(AP13=0,0,SUM(AP$4:AP13))","v":0},{"$f":"IF(AQ13=0,0,SUM(AQ$4:AQ13))","v":0},{"$f":"IF(AR13=0,0,SUM(AR$4:AR13))","v":0},{"$f":"IF(AS13=0,0,SUM(AS$4:AS13))","v":0},{"$f":"IF(AT13=0,0,SUM(AT$4:AT13))","v":0},{"$f":"IF(AU13=0,0,SUM(AU$4:AU13))","v":0},{"$f":"IF(AV13=0,0,SUM(AV$4:AV13))","v":0},{"$f":"IF(AW13=0,0,SUM(AW$4:AW13))","v":0},null,10,0,0,0,0,0,0,0,0,0,0,0,null,10,null,10,"Project Finances",0,0,0,0,0,0,1,0,0,6,6,0,0,0,75,0,0,0,1,0,8]
["Level 2 - Experience",1,0,null,null,null,null,null,null,null,null,null,null,null,null,null,null,null,null,"Project Structure and Governance",{"$f":"C83","v":0},{"$f":"C85","v":0},{"$f":"C87","v":0},{"$f":"C84","v":0},{"$f":"C86","v":0},{"$f":"C88","v":0},{"$f":"C82","v":1},2,0,0,null,0,0,6,6,1,null,1,0,0,0,0,0,0,0,0,0,0,0,null,{"$f":"IF(AL14=0,0,SUM(AL$4:AL14))","v":11},{"$f":"IF(AM14=0,0,SUM(AM$4:AM14))","v":0},{"$f":"IF(AN14=0,0,SUM(AN$4:AN14))","v":0},{"$f":"IF(AO14=0,0,SUM(AO$4:AO14))","v":0},{"$f":"IF(AP14=0,0,SUM(AP$4:AP14))","v":0},{"$f":"IF(AQ14=0,0,SUM(AQ$4:AQ14))","v":0},{"$f":"IF(AR14=0,0,SUM(AR$4:AR14))","v":0},{"$f":"IF(AS14=0,0,SUM(AS$4:AS14))","v":0},{"$f":"IF(AT14=0,0,SUM(AT$4:AT14))","v":0},{"$f":"IF(AU14=0,0,SUM(AU$4:AU14))","v":0},{"$f":"IF(AV14=0,0,SUM(AV$4:AV14))","v":0},{"$f":"IF(AW14=0,0,SUM(AW$4:AW14))","v":0},null,11,0,0,0,0,0,0,0,0,0,0,0,null,11,null,11,"Project Structure and Governance",0,0,0,0,0,0,1,0,0,6,6,0,0,0,75,0,0,0,1,0,8]
["Level 3  -Knowledge",1,0,null,null,null,null,null,null,null,null,null,null,null,null,null,null,null,null,"Quality Management and Assurance",{"$f":"C91","v":0},{"$f":"C93","v":0},{"$f":"C95","v":0},{"$f":"C92","v":0},{"$f":"C94","v":0},{"$f":"C96","v":0},{"$f":"C90","v":1},2,0,0,null,0,0,6,6,1,null,1,0,0,0,0,0,0,0,0,0,0,0,null,{"$f":"IF(AL15=0,0,SUM(AL$4:AL15))","v":12},{"$f":"IF(AM15=0,0,SUM(AM$4:AM15))","v":0},{"$f":"IF(AN15=0,0,SUM(AN$4:AN15))","v":0},{"$f":"IF(AO15=0,0,SUM(AO$4:AO15))","v":0},{"$f":"IF(AP15=0,0,SUM(AP$4:AP15))","v":0},{"$f":"IF(AQ15=0,0,SUM(AQ$4:AQ15))","v":0},{"$f":"IF(AR15=0,0,SUM(AR$4:AR15))","v":0},{"$f":"IF(AS15=0,0,SUM(AS$4:AS15))","v":0},{"$f":"IF(AT15=0,0,SUM(AT$4:AT15))","v":0},{"$f":"IF(AU15=0,0,SUM(AU$4:AU15))","v":0},{"$f":"IF(AV15=0,0,SUM(AV$4:AV15))","v":0},{"$f":"IF(AW15=0,0,SUM(AW$4:AW15))","v":0},null,12,0,0,0,0,0,0,0,0,0,0,0,null,12,null,12,"Quality Management and Assurance",0,0,0,0,0,0,1,0,0,6,6,0,0,0,75,0,0,0,1,0,8]
["Level 3 - Experience",1,0,null,null,null,null,null,null,null,null,null,null,null,null,null,null,null,null,null,null,null,null,null,null,null,null,null,null,null,null,null,null,null,null,null,null,null,null,null,null,null,null,null,null,null,null,null,null,null,{"$f":"MAX(AY4:AY15)","v":12},{"$f":"MAX(AZ4:AZ15)","v":0},0,0,0,0,0,0,0,0,0,0]
["Professionalism ",1,null,null,null,null,null,null,null,null,null,null,null,null,null,null,null,null,null,null,null,null,null,null,null,null,null,null,null,null,null,null,null,null,null,null,null,null,null,null,null,null,null,null,null,null,null,null,null,0,{"$f":"SUM($AY$16:AY16)","v":12},{"$f":"SUM($AY$16:AZ16)","v":12},{"$f":"SUM($AY$16:BA16)","v":12},{"$f":"SUM($AY$16:BB16)","v":12},{"$f":"SUM($AY$16:BC16)","v":12},{"$f":"SUM($AY$16:BD16)","v":12},{"$f":"SUM($AY$16:BE16)","v":12},{"$f":"SUM($AY$16:BF16)","v":12},{"$f":"SUM($AY$16:BG16)","v":12},{"$f":"SUM($AY$16:BH16)","v":12},{"$f":"SUM($AY$16:BI16)","v":12},{"$f":"SUM($AY$16:BJ16)","v":12}]
["Importance ",1,{"$f":"IF(B18=1,1,B18-1)","v":1},{"$f":"SUM(B18:B24)","v":7},{"$f":"IF(D18=7,\"Not started\",\"In progress\")","v":"Not started"},null,{"$f":"_xlfn.CONCAT($M$6,A18,$M$5,B19,$M$5,B20,$M$5,B21,$M$5,B22,$M$5,B23,$M$5,B24,$M$5,B25,$M$7)","v":"[Importance _1_1_1_1_1_1_1]"},null,null,null,null,null,null,null,null,null,null,null,null,null,null,null,null,null,null,null,null,null,null,null,null,"Constants",null,null,"Axis Calculations"]
["Level 1 - Knowledge",1,{"$f":"IF(B19<3,0,B19-2)","v":0},null,null,null,null,null,null,null,null,null,"About You ",null,null,null,null,null,null,null,null,null,null,null,null,null,null,null,null,null,null,"Km1",2,null,"Min axis",{"$f":"MIN(AC4:AD15)","v":0},{"$f":"AJ19-1","v":-1},null,null,null,null,null,null,null,null,null,null,null,null,null,null,null,null,null,null,null,null,null,null,null,null,null,null,null,null,null,null,null,null,null,null,null,null,null,null,null,{"$f":"AF3","v":"K(total)"},{"$f":"AG3","v":"E(total)"},"Strength Score","Strength Rank"]
["Level 1 - Experience ",1,0,null,null,null,null,null,null,null,null,null,"First Name",{"$f":"'About you '!C22","v":"First Name"},{"$f":"_xlfn.CONCAT($M$6,M20,$M$5,N20,$M$7)","v":"[First Name_First Name]"},null,null,null,null,null,null,null,null,null,null,null,null,null,null,null,null,"Km2",1.5,null,"Max axis",{"$f":"MAX(AC4:AD15)","v":0},{"$f":"AJ20+1","v":1},null,null,null,null,null,null,null,null,null,null,null,null,null,null,null,null,null,null,null,null,null,null,null,null,null,null,null,null,null,null,null,null,null,null,null,null,null,null,null,0,0,{"$f":"SUM(BY20:BZ20)","v":0}]
["Level 2 - Knowledge",1,0,null,null,null,null,null,null,null,null,null,"Surname",{"$f":"'About you '!J22","v":"Last Name"},{"$f":"_xlfn.CONCAT($M$6,M21,$M$5,N21,$M$7)","v":"[Surname_Last Name]"},null,null,null,null,null,null,null,null,null,null,null,null,null,null,null,null,"Km3",1,null,"Major Unit",null,1,null,null,null,null,null,null,null,null,null,null,null,null,null,null,null,null,null,null,null,null,null,null,null,null,null,null,null,null,null,null,null,null,null,null,null,null,null,null,null,0,0,{"$f":"SUM(BY21:BZ21)","v":0}]
["Level 2 - Experience",1,0,null,null,null,null,null,null,null,null,null,"Email",{"$f":"'About you '!C34","v":"Enter your Email Address Here"},"[Email_Enter your Email Address Here]",null,null,null,null,null,null,null,null,null,null,null,null,null,null,null,null,"Em1",{"$f":"AG19","v":2},null,null,null,null,null,null,null,null,null,null,null,null,null,null,null,null,null,null,null,null,null,null,null,null,null,null,null,null,null,null,null,null,null,null,null,null,null,null,null,null,null,null,null,0,0,0]
["Level 3  -Knowledge",1,0,null,null,null,null,null,null,null,null,null,"Role",{"$f":"'About you '!C46","v":"Please Select From Drop Down List"},"[Role_Please Select From Drop Down List]",null,null,null,null,null,null,null,null,null,null,null,null,null,null,null,null,"Em2",{"$f":"AG20","v":1.5},null,null,null,null,null,null,null,null,null,null,null,null,null,null,null,null,null,null,null,null,null,null,null,null,null,null,null,null,null,null,null,null,null,null,null,null,null,null,null,null,null,null,null,0,0,0]
["Level 3 - Experience",1,0,null,null,null,null,null,null,null,null,null,"Role-Other",{"$f":"'About you '!C52","v":0},"[Role-Other_0]",null,null,null,null,null,null,null,null,null,null,null,null,null,null,null,null,"Em3",{"$f":"AG21","v":1},null,null,null,null,null,null,null,null,null,null,null,null,null,null,null,null,null,null,null,null,null,null,null,null,null,null,null,null,null,null,null,null,null,null,null,null,null,null,null,null,null,null,null,0,0,0]
["Project Delivery",1,null,null,null,null,{"$f":"_xlfn.CONCAT($M$6,A25,$M$5,B26,$M$5,B27,$M$5,B28,$M$5,B29,$M$5,B30,$M$5,B31,$M$5,B32,$M$7)","v":"[Project Delivery_1_1_1_1_1_1_1]"},null,null,null,null,null,"ORG",{"$f":"'About you '!C64","v":"Please select from drop down list"},"[ORG_Please select from drop down list]",null,null,null,null,null,null,null,null,null,null,null,null,null,null,null,null,"Im",6,null,null,null,null,null,null,null,null,null,null,null,null,null,null,null,null,null,null,null,null,null,null,null,null,null,null,null,null,null,null,null,null,null,null,null,null,null,null,null,null,null,null,null,0,0,0]
["Importance ",1,{"$f":"IF(B26=1,1,B26-1)","v":1},{"$f":"SUM(B26:B32)","v":7},{"$f":"IF(D26=7,\"Not started\",\"In progress\")","v":"Not started"},null,null,null,null,null,null,null,"ORG-Other",{"$f":"'About you '!C70","v":0},"[ORG-Other_0]",null,null,null,null,null,null,null,null,null,null,null,null,null,null,null,null,null,null,null,null,null,null,null,null,null,null,null,null,null,null,null,null,null,null,null,null,null,null,null,null,null,null,null,null,null,null,null,null,null,null,null,null,null,null,null,null,null,null,null,null,null,0,0,0]
["Level 1 - Knowledge",1,{"$f":"IF(B27<3,0,B27-2)","v":0},null,null,null,null,null,null,null,null,null,"Career",{"$f":"'About you '!C82","v":"Please Select From Drop Down List"},"[Career_Please Select From Drop Down List]",null,null,null,null,null,null,null,null,null,null,null,null,null,null,null,null,null,null,null,null,null,null,null,null,null,null,null,null,null,null,null,null,null,null,null,null,null,null,null,null,null,null,null,null,null,null,null,null,null,null,null,null,null,null,null,null,null,null,null,null,null,0,0,0]
["Level 1 - Experience ",1,0,null,null,null,null,null,null,null,null,null,"Role-length",{"$f":"'About you '!C95","v":"Please Select From Drop Down List"},"[Role-length_Please Select From Drop Down List]",null,null,null,null,null,null,null,null,null,null,null,null,null,null,null,null,null,null,null,null,null,null,null,null,null,null,null,null,null,null,null,null,null,null,null,null,null,null,null,null,null,null,null,null,null,null,null,null,null,null,null,null,null,null,null,null,null,null,null,null,null,0,0,0]
["Level 2 - Knowledge",1,0,null,null,null,null,null,null,null,null,null,"Experience",{"$f":"'About you '!C108","v":"Please select from drop down list"},"[Experience_Please select from drop down list]",null,null,null,null,null,null,null,null,null,null,null,null,null,null,null,null,null,null,null,null,null,null,null,null,null,null,null,null,null,null,null,null,null,null,null,null,null,null,null,null,null,null,null,null,null,null,null,null,null,null,null,null,null,null,null,null,null,null,null,null,null,0,0,0]
["Level 2 - Experience",1,0,null,null,null,null,null,null,null,null,null,"Training",{"$f":"'About you '!C123","v":""},"[Training_]",null,null,null,null,null,null,null,null,null,null,null,null,null,null,null,null,null,null,null,null,null,null,null,null,null,null,null,null,null,null,null,null,null,null,null,null,null,null,null,null,null,null,null,null,null,null,null,null,null,null,null,null,null,null,null,null,null,null,null,null,null,0,0,0]
["Level 3  -Knowledge",1,0,null,null,null,null,null,null,null,null,null,null,null,null,null,null,null,null,null,null,null,null,null,null,null,null,null,null,null,null,"Strengths",null,null,null,null,null,null,null,null,null,null,null,null,null,null,null,null,null,null,null,null,null,null,null,null,null,null,null,null,null,null,null,null,null,null,null,null,null,null,null,null,null,null,null,null,0,0,0]
["Level 3 - Experience",1,0,null,null,null,null,null,null,null,null,null,null,null,null,null,null,null,null,null,null,null,null,null,null,null,null,null,null,null,null,null,null,null,null,null,null,"Rank Duplication calculator",null,null,null,null,null,null,null,null,null,null,null,null,null,null,null,null,null,null,null,null,null,null,null,null,null,null,null,null,null,null,null,null,null,null,null,null,null,null,null,null,"Strengths Sorted Results"]
["Communication Management",1,null,null,null,null,{"$f":"_xlfn.CONCAT($M$6,A33,$M$5,B34,$M$5,B35,$M$5,B36,$M$5,B37,$M$5,B38,$M$5,B39,$M$5,B40,$M$7)","v":"[Communication Management_1_1_1_1_1_1_1]"},null,null,null,null,null,"Action Tracker","as is row","Action","Date",null,"check","to be Row",null,null,null,null,null,null,null,null,null,null,null,null,"Summary","K(Raw)","E(Raw)","Strength Score","Rank",null,1,2,3,4,5,6,7,8,9,10,11,12,null,1,2,3,4,5,6,7,8,9,10,11,12,null,1,2,3,4,5,6,7,8,9,10,11,12,null," Result",null,"Rank","Comp","Strength Score","sub comps"]
["Importance ",1,{"$f":"IF(B34=1,1,B34-1)","v":1},{"$f":"SUM(B34:B40)","v":7},{"$f":"IF(D34=7,\"Not started\",\"In progress\")","v":"Not started"},null,null,null,null,null,null,null,"Leadership and Team Management",1,{"$f":"'Leadership and team management'!E203","v":"e.g. I will aim to provide constructive peer feedback on at least one occasion within the next four weeks"},{"$f":"'Leadership and team management'!N203","v":"2020-01-01"},null,{"$f":"IF(O34=0,0,1)","v":1},{"$f":"IF(R34=1,SUM($R$34:R34),\"\")","v":1},null,null,null,null,null,null,null,null,null,null,null,null,"Leadership and Team Management ",{"$f":"AC4","v":0},{"$f":"AD4","v":0},{"$f":"AG34+AH34","v":0},{"$f":"RANK(AI34,$AI$34:$AI$45,0)","v":1},null,{"$f":"IF($AJ34=AL$3,1,0)","v":1},{"$f":"IF($AJ34=AM$3,1,0)","v":0},0,0,0,0,0,0,0,0,0,0,null,{"$f":"IF(AL34=0,0,SUM(AL$34:AL34))","v":1},{"$f":"IF(AM34=0,0,SUM(AM$34:AM34))","v":0},{"$f":"IF(AN34=0,0,SUM(AN$34:AN34))","v":0},{"$f":"IF(AO34=0,0,SUM(AO$34:AO34))","v":0},{"$f":"IF(AP34=0,0,SUM(AP$34:AP34))","v":0},{"$f":"IF(AQ34=0,0,SUM(AQ$34:AQ34))","v":0},{"$f":"IF(AR34=0,0,SUM(AR$34:AR34))","v":0},{"$f":"IF(AS34=0,0,SUM(AS$34:AS34))","v":0},{"$f":"IF(AT34=0,0,SUM(AT$34:AT34))","v":0},{"$f":"IF(AU34=0,0,SUM(AU$34:AU34))","v":0},{"$f":"IF(AV34=0,0,SUM(AV$34:AV34))","v":0},{"$f":"IF(AW34=0,0,SUM(AW$34:AW34))","v":0},null,{"$f":"IF(AY34=0,0,AX$47+AY34)","v":1},{"$f":"IF(AZ34=0,0,AY$47+AZ34)","v":0},0,0,0,0,0,0,0,0,0,0,null,{"$f":"SUM(BL34:BW34)","v":1},null,1,{"$f":"INDEX($AF$34:$AI$45,MATCH($CA34,$BY$34:$BY$45,0),1)","v":"Leadership and Team Management "},{"$f":"INDEX($AF$34:$AI$45,MATCH($CA34,$BY$34:$BY$45,0),4)","v":0},{"$f":"INDEX($CB$44:$CB$55,MATCH(CB34,$CA$44:$CA$55,0),1)","v":"People Management, Model Desirable Behaviour, Leading a project, Matrix Management & People Management"}]
["Level 1 - Knowledge",1,0,null,null,null,null,null,null,null,null,null,"Leadership and Team Management",2,{"$f":"'Leadership and team management'!E204","v":0},{"$f":"'Leadership and team management'!N204","v":"00:00:00"},null,{"$f":"IF(O35=0,0,1)","v":0},{"$f":"IF(R35=1,SUM($R$34:R35),\"\")","v":""},null,null,null,null,null,null,null,null,null,null,null,null,"Resources Management",{"$f":"AC5","v":0},0,{"$f":"AG35+AH35","v":0},{"$f":"RANK(AI35,$AI$34:$AI$45,0)","v":1},null,{"$f":"IF($AJ35=AL$3,1,0)","v":1},0,0,0,0,0,0,0,0,0,0,0,null,{"$f":"IF(AL35=0,0,SUM(AL$34:AL35))","v":2},{"$f":"IF(AM35=0,0,SUM(AM$34:AM35))","v":0},{"$f":"IF(AN35=0,0,SUM(AN$34:AN35))","v":0},{"$f":"IF(AO35=0,0,SUM(AO$34:AO35))","v":0},{"$f":"IF(AP35=0,0,SUM(AP$34:AP35))","v":0},{"$f":"IF(AQ35=0,0,SUM(AQ$34:AQ35))","v":0},{"$f":"IF(AR35=0,0,SUM(AR$34:AR35))","v":0},{"$f":"IF(AS35=0,0,SUM(AS$34:AS35))","v":0},{"$f":"IF(AT35=0,0,SUM(AT$34:AT35))","v":0},{"$f":"IF(AU35=0,0,SUM(AU$34:AU35))","v":0},{"$f":"IF(AV35=0,0,SUM(AV$34:AV35))","v":0},{"$f":"IF(AW35=0,0,SUM(AW$34:AW35))","v":0},null,{"$f":"IF(AY35=0,0,AX$47+AY35)","v":2},0,0,0,0,0,0,0,0,0,0,0,null,2,null,2,{"$f":"INDEX($AF$34:$AI$45,MATCH($CA35,$BY$34:$BY$45,0),1)","v":"Resources Management"},{"$f":"INDEX($AF$34:$AI$45,MATCH($CA35,$BY$34:$BY$45,0),4)","v":0},{"$f":"INDEX($CB$44:$CB$55,MATCH(CB35,$CA$44:$CA$55,0),1)","v":"Resource Identification, Procurement Process, Supplier Management & Resource Planning Techniques"}]
["Level 1 - Experience ",1,0,null,null,null,null,null,null,null,null,null,"Leadership and Team Management",3,{"$f":"'Leadership and team management'!E205","v":0},{"$f":"'Leadership and team management'!N205","v":"00:00:00"},null,0,{"$f":"IF(R36=1,SUM($R$34:R36),\"\")","v":""},null,null,null,null,null,null,null,null,null,null,null,null,"Professionalism ",{"$f":"AC6","v":0},0,0,1,null,1,0,0,0,0,0,0,0,0,0,0,0,null,{"$f":"IF(AL36=0,0,SUM(AL$34:AL36))","v":3},{"$f":"IF(AM36=0,0,SUM(AM$34:AM36))","v":0},{"$f":"IF(AN36=0,0,SUM(AN$34:AN36))","v":0},{"$f":"IF(AO36=0,0,SUM(AO$34:AO36))","v":0},{"$f":"IF(AP36=0,0,SUM(AP$34:AP36))","v":0},{"$f":"IF(AQ36=0,0,SUM(AQ$34:AQ36))","v":0},{"$f":"IF(AR36=0,0,SUM(AR$34:AR36))","v":0},{"$f":"IF(AS36=0,0,SUM(AS$34:AS36))","v":0},{"$f":"IF(AT36=0,0,SUM(AT$34:AT36))","v":0},{"$f":"IF(AU36=0,0,SUM(AU$34:AU36))","v":0},{"$f":"IF(AV36=0,0,SUM(AV$34:AV36))","v":0},{"$f":"IF(AW36=0,0,SUM(AW$34:AW36))","v":0},null,3,0,0,0,0,0,0,0,0,0,0,0,null,3,null,3,"Professionalism ",0,{"$f":"INDEX($CB$44:$CB$55,MATCH(CB36,$CA$44:$CA$55,0),1)","v":"Culture, Community of practice, Conflicts of Interest, Ethics and compliance & Personal and professional development"}]
["Level 2 - Knowledge",1,0,null,null,null,null,null,null,null,null,null,"Leadership and Team Management",4,{"$f":"'Leadership and team management'!E206","v":0},{"$f":"'Leadership and team management'!N206","v":"00:00:00"},null,0,{"$f":"IF(R37=1,SUM($R$34:R37),\"\")","v":""},null,null,null,null,null,null,null,null,null,null,null,null,"Project Delivery",{"$f":"AC7","v":0},0,0,1,null,1,0,0,0,0,0,0,0,0,0,0,0,null,{"$f":"IF(AL37=0,0,SUM(AL$34:AL37))","v":4},{"$f":"IF(AM37=0,0,SUM(AM$34:AM37))","v":0},{"$f":"IF(AN37=0,0,SUM(AN$34:AN37))","v":0},{"$f":"IF(AO37=0,0,SUM(AO$34:AO37))","v":0},{"$f":"IF(AP37=0,0,SUM(AP$34:AP37))","v":0},{"$f":"IF(AQ37=0,0,SUM(AQ$34:AQ37))","v":0},{"$f":"IF(AR37=0,0,SUM(AR$34:AR37))","v":0},{"$f":"IF(AS37=0,0,SUM(AS$34:AS37))","v":0},{"$f":"IF(AT37=0,0,SUM(AT$34:AT37))","v":0},{"$f":"IF(AU37=0,0,SUM(AU$34:AU37))","v":0},{"$f":"IF(AV37=0,0,SUM(AV$34:AV37))","v":0},{"$f":"IF(AW37=0,0,SUM(AW$34:AW37))","v":0},null,4,0,0,0,0,0,0,0,0,0,0,0,null,4,null,4,"Project Delivery",0,{"$f":"INDEX($CB$44:$CB$55,MATCH(CB37,$CA$44:$CA$55,0),1)","v":"Handover to BAU, Change Management, Quality Improvement Process, Benefits management & Lessons learned "}]
["Level 2 - Experience",1,0,null,null,null,null,null,null,null,null,null,"Leadership and Team Management",5,{"$f":"'Leadership and team management'!E207","v":0},{"$f":"'Leadership and team management'!N207","v":"00:00:00"},null,0,{"$f":"IF(R38=1,SUM($R$34:R38),\"\")","v":""},null,null,null,null,null,null,null,null,null,null,null,null,"Communication Management",{"$f":"AC8","v":0},0,0,1,null,1,0,0,0,0,0,0,0,0,0,0,0,null,{"$f":"IF(AL38=0,0,SUM(AL$34:AL38))","v":5},{"$f":"IF(AM38=0,0,SUM(AM$34:AM38))","v":0},{"$f":"IF(AN38=0,0,SUM(AN$34:AN38))","v":0},{"$f":"IF(AO38=0,0,SUM(AO$34:AO38))","v":0},{"$f":"IF(AP38=0,0,SUM(AP$34:AP38))","v":0},{"$f":"IF(AQ38=0,0,SUM(AQ$34:AQ38))","v":0},{"$f":"IF(AR38=0,0,SUM(AR$34:AR38))","v":0},{"$f":"IF(AS38=0,0,SUM(AS$34:AS38))","v":0},{"$f":"IF(AT38=0,0,SUM(AT$34:AT38))","v":0},{"$f":"IF(AU38=0,0,SUM(AU$34:AU38))","v":0},{"$f":"IF(AV38=0,0,SUM(AV$34:AV38))","v":0},{"$f":"IF(AW38=0,0,SUM(AW$34:AW38))","v":0},null,5,0,0,0,0,0,0,0,0,0,0,0,null,5,null,5,"Communication Management",0,{"$f":"INDEX($CB$44:$CB$55,MATCH(CB38,$CA$44:$CA$55,0),1)","v":"Creating the comms and engagement plan, Effective 2-way conversation, Presentation skills and facilitation & Stakeholder identification and mapping "}]
["Level 3  -Knowledge",1,0,null,null,null,null,null,null,null,null,null,"Leadership and Team Management",6,{"$f":"'Leadership and team management'!E208","v":0},{"$f":"'Leadership and team management'!N208","v":"00:00:00"},null,0,{"$f":"IF(R39=1,SUM($R$34:R39),\"\")","v":""},null,null,null,null,null,null,null,null,null,null,null,null,"Conflict Management",{"$f":"AC9","v":0},0,0,1,null,1,0,0,0,0,0,0,0,0,0,0,0,null,{"$f":"IF(AL39=0,0,SUM(AL$34:AL39))","v":6},{"$f":"IF(AM39=0,0,SUM(AM$34:AM39))","v":0},{"$f":"IF(AN39=0,0,SUM(AN$34:AN39))","v":0},{"$f":"IF(AO39=0,0,SUM(AO$34:AO39))","v":0},{"$f":"IF(AP39=0,0,SUM(AP$34:AP39))","v":0},{"$f":"IF(AQ39=0,0,SUM(AQ$34:AQ39))","v":0},{"$f":"IF(AR39=0,0,SUM(AR$34:AR39))","v":0},{"$f":"IF(AS39=0,0,SUM(AS$34:AS39))","v":0},{"$f":"IF(AT39=0,0,SUM(AT$34:AT39))","v":0},{"$f":"IF(AU39=0,0,SUM(AU$34:AU39))","v":0},{"$f":"IF(AV39=0,0,SUM(AV$34:AV39))","v":0},{"$f":"IF(AW39=0,0,SUM(AW$34:AW39))","v":0},null,6,0,0,0,0,0,0,0,0,0,0,0,null,6]
["Level 3 - Experience",1,0,null,null,null,null,null,null,null,null,null,"Leadership and Team Management",7,{"$f":"'Leadership and team management'!E209","v":0},{"$f":"'Leadership and team management'!N209","v":"00:00:00"},null,0,{"$f":"IF(R40=1,SUM($R$34:R40),\"\")","v":""},null,null,null,null,null,null,null,null,null,null,null,null,"Planning for success",{"$f":"AC10","v":0},0,0,1,null,1,0,0,0,0,0,0,0,0,0,0,0,null,{"$f":"IF(AL40=0,0,SUM(AL$34:AL40))","v":7},{"$f":"IF(AM40=0,0,SUM(AM$34:AM40))","v":0},{"$f":"IF(AN40=0,0,SUM(AN$34:AN40))","v":0},{"$f":"IF(AO40=0,0,SUM(AO$34:AO40))","v":0},{"$f":"IF(AP40=0,0,SUM(AP$34:AP40))","v":0},{"$f":"IF(AQ40=0,0,SUM(AQ$34:AQ40))","v":0},{"$f":"IF(AR40=0,0,SUM(AR$34:AR40))","v":0},{"$f":"IF(AS40=0,0,SUM(AS$34:AS40))","v":0},{"$f":"IF(AT40=0,0,SUM(AT$34:AT40))","v":0},{"$f":"IF(AU40=0,0,SUM(AU$34:AU40))","v":0},{"$f":"IF(AV40=0,0,SUM(AV$34:AV40))","v":0},{"$f":"IF(AW40=0,0,SUM(AW$34:AW40))","v":0},null,7,0,0,0,0,0,0,0,0,0,0,0,null,7]
["Conflict Management",1,null,null,null,null,{"$f":"_xlfn.CONCAT($M$6,A41,$M$5,B42,$M$5,B43,$M$5,B44,$M$5,B45,$M$5,B46,$M$5,B47,$M$5,B48,$M$7)","v":"[Conflict Management_1_1_1_1_1_1_1]"},null,null,null,null,null,"Leadership and Team Management",8,{"$f":"'Leadership and team management'!E210","v":0},{"$f":"'Leadership and team management'!N210","v":"00:00:00"},null,0,{"$f":"IF(R41=1,SUM($R$34:R41),\"\")","v":""},null,null,null,null,null,null,null,null,null,null,null,null,"Scope Management",{"$f":"AC11","v":0},0,0,1,null,1,0,0,0,0,0,0,0,0,0,0,0,null,{"$f":"IF(AL41=0,0,SUM(AL$34:AL41))","v":8},{"$f":"IF(AM41=0,0,SUM(AM$34:AM41))","v":0},{"$f":"IF(AN41=0,0,SUM(AN$34:AN41))","v":0},{"$f":"IF(AO41=0,0,SUM(AO$34:AO41))","v":0},{"$f":"IF(AP41=0,0,SUM(AP$34:AP41))","v":0},{"$f":"IF(AQ41=0,0,SUM(AQ$34:AQ41))","v":0},{"$f":"IF(AR41=0,0,SUM(AR$34:AR41))","v":0},{"$f":"IF(AS41=0,0,SUM(AS$34:AS41))","v":0},{"$f":"IF(AT41=0,0,SUM(AT$34:AT41))","v":0},{"$f":"IF(AU41=0,0,SUM(AU$34:AU41))","v":0},{"$f":"IF(AV41=0,0,SUM(AV$34:AV41))","v":0},{"$f":"IF(AW41=0,0,SUM(AW$34:AW41))","v":0},null,8,0,0,0,0,0,0,0,0,0,0,0,null,8]
["Importance ",1,{"$f":"IF(B42=1,1,B42-1)","v":1},{"$f":"SUM(B42:B48)","v":7},{"$f":"IF(D42=7,\"Not started\",\"In progress\")","v":"Not started"},null,null,null,null,null,null,null,"Leadership and Team Management",9,{"$f":"'Leadership and team management'!E211","v":0},{"$f":"'Leadership and team management'!N211","v":"00:00:00"},null,0,{"$f":"IF(R42=1,SUM($R$34:R42),\"\")","v":""},null,null,null,null,null,null,null,null,null,null,null,null,"Risk and Issue Management",{"$f":"AC12","v":0},0,0,1,null,1,0,0,0,0,0,0,0,0,0,0,0,null,{"$f":"IF(AL42=0,0,SUM(AL$34:AL42))","v":9},{"$f":"IF(AM42=0,0,SUM(AM$34:AM42))","v":0},{"$f":"IF(AN42=0,0,SUM(AN$34:AN42))","v":0},{"$f":"IF(AO42=0,0,SUM(AO$34:AO42))","v":0},{"$f":"IF(AP42=0,0,SUM(AP$34:AP42))","v":0},{"$f":"IF(AQ42=0,0,SUM(AQ$34:AQ42))","v":0},{"$f":"IF(AR42=0,0,SUM(AR$34:AR42))","v":0},{"$f":"IF(AS42=0,0,SUM(AS$34:AS42))","v":0},{"$f":"IF(AT42=0,0,SUM(AT$34:AT42))","v":0},{"$f":"IF(AU42=0,0,SUM(AU$34:AU42))","v":0},{"$f":"IF(AV42=0,0,SUM(AV$34:AV42))","v":0},{"$f":"IF(AW42=0,0,SUM(AW$34:AW42))","v":0},null,9,0,0,0,0,0,0,0,0,0,0,0,null,9]
["Level 1 - Knowledge",1,0,null,null,null,null,null,null,null,null,null,"Leadership and Team Management",10,{"$f":"'Leadership and team management'!E212","v":0},{"$f":"'Leadership and team management'!N212","v":"00:00:00"},null,0,{"$f":"IF(R43=1,SUM($R$34:R43),\"\")","v":""},null,null,null,null,null,null,null,null,null,null,null,null,"Project Finances",{"$f":"AC13","v":0},0,0,1,null,1,0,0,0,0,0,0,0,0,0,0,0,null,{"$f":"IF(AL43=0,0,SUM(AL$34:AL43))","v":10},{"$f":"IF(AM43=0,0,SUM(AM$34:AM43))","v":0},{"$f":"IF(AN43=0,0,SUM(AN$34:AN43))","v":0},{"$f":"IF(AO43=0,0,SUM(AO$34:AO43))","v":0},{"$f":"IF(AP43=0,0,SUM(AP$34:AP43))","v":0},{"$f":"IF(AQ43=0,0,SUM(AQ$34:AQ43))","v":0},{"$f":"IF(AR43=0,0,SUM(AR$34:AR43))","v":0},{"$f":"IF(AS43=0,0,SUM(AS$34:AS43))","v":0},{"$f":"IF(AT43=0,0,SUM(AT$34:AT43))","v":0},{"$f":"IF(AU43=0,0,SUM(AU$34:AU43))","v":0},{"$f":"IF(AV43=0,0,SUM(AV$34:AV43))","v":0},{"$f":"IF(AW43=0,0,SUM(AW$34:AW43))","v":0},null,10,0,0,0,0,0,0,0,0,0,0,0,null,10,null,"comp","sub comp"]
["Level 1 - Experience ",1,0,null,null,null,null,null,null,null,null,null,"Leadership and Team Management",11,{"$f":"'Leadership and team management'!E213","v":0},{"$f":"'Leadership and team management'!N213","v":"00:00:00"},null,0,{"$f":"IF(R44=1,SUM($R$34:R44),\"\")","v":""},null,null,null,null,null,null,null,null,null,null,null,null,"Project Structure and Governance",{"$f":"AC14","v":0},0,0,1,null,1,0,0,0,0,0,0,0,0,0,0,0,null,{"$f":"IF(AL44=0,0,SUM(AL$34:AL44))","v":11},{"$f":"IF(AM44=0,0,SUM(AM$34:AM44))","v":0},{"$f":"IF(AN44=0,0,SUM(AN$34:AN44))","v":0},{"$f":"IF(AO44=0,0,SUM(AO$34:AO44))","v":0},{"$f":"IF(AP44=0,0,SUM(AP$34:AP44))","v":0},{"$f":"IF(AQ44=0,0,SUM(AQ$34:AQ44))","v":0},{"$f":"IF(AR44=0,0,SUM(AR$34:AR44))","v":0},{"$f":"IF(AS44=0,0,SUM(AS$34:AS44))","v":0},{"$f":"IF(AT44=0,0,SUM(AT$34:AT44))","v":0},{"$f":"IF(AU44=0,0,SUM(AU$34:AU44))","v":0},{"$f":"IF(AV44=0,0,SUM(AV$34:AV44))","v":0},{"$f":"IF(AW44=0,0,SUM(AW$34:AW44))","v":0},null,11,0,0,0,0,0,0,0,0,0,0,0,null,11,null,"Leadership and Team Management ","People Management, Model Desirable Behaviour, Leading a project, Matrix Management & People Management"]
["Level 2 - Knowledge",1,0,null,null,null,null,null,null,null,null,null,"Leadership and Team Management",12,{"$f":"'Leadership and team management'!E214","v":0},{"$f":"'Leadership and team management'!N214","v":"00:00:00"},null,0,{"$f":"IF(R45=1,SUM($R$34:R45),\"\")","v":""},null,null,null,null,null,null,null,null,null,null,null,null,"Quality Management and Assurance",{"$f":"AC15","v":0},0,0,1,null,1,0,0,0,0,0,0,0,0,0,0,0,null,{"$f":"IF(AL45=0,0,SUM(AL$34:AL45))","v":12},{"$f":"IF(AM45=0,0,SUM(AM$34:AM45))","v":0},{"$f":"IF(AN45=0,0,SUM(AN$34:AN45))","v":0},{"$f":"IF(AO45=0,0,SUM(AO$34:AO45))","v":0},{"$f":"IF(AP45=0,0,SUM(AP$34:AP45))","v":0},{"$f":"IF(AQ45=0,0,SUM(AQ$34:AQ45))","v":0},{"$f":"IF(AR45=0,0,SUM(AR$34:AR45))","v":0},{"$f":"IF(AS45=0,0,SUM(AS$34:AS45))","v":0},{"$f":"IF(AT45=0,0,SUM(AT$34:AT45))","v":0},{"$f":"IF(AU45=0,0,SUM(AU$34:AU45))","v":0},{"$f":"IF(AV45=0,0,SUM(AV$34:AV45))","v":0},{"$f":"IF(AW45=0,0,SUM(AW$34:AW45))","v":0},null,12,0,0,0,0,0,0,0,0,0,0,0,null,12,null,"Resources Management","Resource Identification, Procurement Process, Supplier Management & Resource Planning Techniques"]
["Level 2 - Experience",1,0,null,null,null,null,null,null,null,null,null,"Resources management",1,{"$f":"'Resources management'!E201","v":0},{"$f":"'Resources management'!N201","v":"00:00:00"},null,0,{"$f":"IF(R46=1,SUM($R$34:R46),\"\")","v":""},null,null,null,null,null,null,null,null,null,null,null,null,null,null,null,null,null,null,null,null,null,null,null,null,null,null,null,null,null,null,null,{"$f":"MAX(AY34:AY45)","v":12},{"$f":"MAX(AZ34:AZ45)","v":0},0,0,0,0,0,0,0,0,0,0,null,null,null,null,null,null,null,null,null,null,null,null,null,null,null,null,"Professionalism ","Culture, Community of practice, Conflicts of Interest, Ethics and compliance & Personal and professional development"]
["Level 3  -Knowledge",1,0,null,null,null,null,null,null,null,null,null,"Resources management",2,{"$f":"'Resources management'!E202","v":0},{"$f":"'Resources management'!N202","v":"00:00:00"},null,0,{"$f":"IF(R47=1,SUM($R$34:R47),\"\")","v":""},null,null,null,null,null,null,null,null,null,null,null,null,null,null,null,null,null,null,null,null,null,null,null,null,null,null,null,null,null,null,0,{"$f":"SUM($AY$46:AY46)","v":12},{"$f":"SUM($AY$46:AZ46)","v":12},{"$f":"SUM($AY$46:BA46)","v":12},{"$f":"SUM($AY$46:BB46)","v":12},{"$f":"SUM($AY$46:BC46)","v":12},{"$f":"SUM($AY$46:BD46)","v":12},{"$f":"SUM($AY$46:BE46)","v":12},{"$f":"SUM($AY$46:BF46)","v":12},{"$f":"SUM($AY$46:BG46)","v":12},{"$f":"SUM($AY$46:BH46)","v":12},{"$f":"SUM($AY$46:BI46)","v":12},{"$f":"SUM($AY$46:BJ46)","v":12},null,null,null,null,null,null,null,null,null,null,null,null,null,null,null,null,"Project Delivery","Handover to BAU, Change Management, Quality Improvement Process, Benefits management & Lessons learned "]
["Level 3 - Experience",1,0,null,null,null,null,null,null,null,null,null,"Resources management",3,{"$f":"'Resources management'!E203","v":0},{"$f":"'Resources management'!N203","v":"00:00:00"},null,0,{"$f":"IF(R48=1,SUM($R$34:R48),\"\")","v":""},null,null,null,null,null,null,null,null,null,null,null,null,null,null,null,null,null,null,null,null,null,null,null,null,null,null,null,null,null,null,null,null,null,null,null,null,null,null,null,null,null,null,null,null,null,null,null,null,null,null,null,null,null,null,null,null,null,null,null,"Communication Management","Creating the comms and engagement plan, Effective 2-way conversation, Presentation skills and facilitation & Stakeholder identification and mapping "]
["Planning for success",1,null,null,null,null,{"$f":"_xlfn.CONCAT($M$6,A49,$M$5,B50,$M$5,B51,$M$5,B52,$M$5,B53,$M$5,B54,$M$5,B55,$M$5,B56,$M$7)","v":"[Planning for success_1_1_1_1_1_1_1]"},null,null,null,null,null,"Resources management",4,{"$f":"'Resources management'!E204","v":0},{"$f":"'Resources management'!N204","v":"00:00:00"},null,0,{"$f":"IF(R49=1,SUM($R$34:R49),\"\")","v":""},null,null,null,null,null,null,null,null,null,null,null,null,null,null,null,null,null,null,null,null,null,null,null,null,null,null,null,null,null,null,null,null,null,null,null,null,null,null,null,null,null,null,null,null,null,null,null,null,null,null,null,null,null,null,null,null,null,null,null,"Conflict Management","Courageous conversation, Negotiation skills, Resolution techniques & Mental resilience and tenacity "]
["Importance ",1,{"$f":"IF(B50=1,1,B50-1)","v":1},{"$f":"SUM(B58:B64)","v":7},{"$f":"IF(D50=7,\"Not started\",\"In progress\")","v":"Not started"},null,null,null,null,null,null,null,"Resources management",5,{"$f":"'Resources management'!E205","v":0},{"$f":"'Resources management'!N205","v":"00:00:00"},null,0,{"$f":"IF(R50=1,SUM($R$34:R50),\"\")","v":""},null,null,null,null,null,null,null,null,null,null,null,null,null,null,null,null,null,null,null,null,null,null,null,null,null,null,null,null,null,null,null,null,null,null,null,null,null,null,null,null,null,null,null,null,null,null,null,null,null,null,null,null,null,null,null,null,null,null,null,"Planning for success","Developing the business case, Detailed implementation and planning, Identifying and managing dependencies  & Best possible value"]
["Level 1 - Knowledge",1,0,null,null,null,null,null,null,null,null,null,"Resources management",6,{"$f":"'Resources management'!E206","v":0},{"$f":"'Resources management'!N206","v":"00:00:00"},null,0,{"$f":"IF(R51=1,SUM($R$34:R51),\"\")","v":""},null,null,null,null,null,null,null,null,null,null,null,null,null,null,null,null,null,null,null,null,null,null,null,null,null,null,null,null,null,null,null,null,null,null,null,null,null,null,null,null,null,null,null,null,null,null,null,null,null,null,null,null,null,null,null,null,null,null,null,"Scope Management","Best possible value, Change control, Requirements management, Managing scope creep & Scope definition"]
["Level 1 - Experience ",1,0,null,null,null,null,null,null,null,null,null,"Resources management",7,{"$f":"'Resources management'!E207","v":0},{"$f":"'Resources management'!N207","v":"00:00:00"},null,0,{"$f":"IF(R52=1,SUM($R$34:R52),\"\")","v":""},null,null,null,null,null,null,null,null,null,null,null,null,null,null,null,null,null,null,null,null,null,null,null,null,null,null,null,null,null,null,null,null,null,null,null,null,null,null,null,null,null,null,null,null,null,null,null,null,null,null,null,null,null,null,null,null,null,null,null,"Risk and Issue Management","Risk identification and analysis, Maintaining the risk register, Risk escalation, Risk mitigation & Issue management"]
["Level 2 - Knowledge",1,0,null,null,null,null,null,null,null,null,null,"Resources management",8,{"$f":"'Resources management'!E208","v":0},{"$f":"'Resources management'!N208","v":"00:00:00"},null,0,{"$f":"IF(R53=1,SUM($R$34:R53),\"\")","v":""},null,null,null,null,null,null,null,null,null,null,null,null,null,null,null,null,null,null,null,null,null,null,null,null,null,null,null,null,null,null,null,null,null,null,null,null,null,null,null,null,null,null,null,null,null,null,null,null,null,null,null,null,null,null,null,null,null,null,null,"Project Finances","Cost planning and budget setting, Cost monitoring and control, Financial appraisal & Financial reporting"]
["Level 2 - Experience",1,0,null,null,null,null,null,null,null,null,null,"Resources management",9,{"$f":"'Resources management'!E209","v":0},{"$f":"'Resources management'!N209","v":"00:00:00"},null,0,{"$f":"IF(R54=1,SUM($R$34:R54),\"\")","v":""},null,null,null,null,null,null,null,null,null,null,null,null,null,null,null,null,null,null,null,null,null,null,null,null,null,null,null,null,null,null,null,null,null,null,null,null,null,null,null,null,null,null,null,null,null,null,null,null,null,null,null,null,null,null,null,null,null,null,null,"Project Structure and Governance","What is a project?, Understanding project lifecycles and project methods, Project documentation, Reporting & Effective decision making "]
["Level 3  -Knowledge",1,0,null,null,null,null,null,null,null,null,null,"Resources management",10,{"$f":"'Resources management'!E210","v":0},{"$f":"'Resources management'!N210","v":"00:00:00"},null,0,{"$f":"IF(R55=1,SUM($R$34:R55),\"\")","v":""},null,null,null,null,null,null,null,null,null,null,null,null,null,null,null,null,null,null,null,null,null,null,null,null,null,null,null,null,null,null,null,null,null,null,null,null,null,null,null,null,null,null,null,null,null,null,null,null,null,null,null,null,null,null,null,null,null,null,null,"Quality Management and Assurance","Gateways, Reviews and audits, Quality planning, Quality control  & Quality Assurance"]
["Level 3 - Experience",1,0,null,null,null,null,null,null,null,null,null,"Resources management",11,{"$f":"'Resources management'!E211","v":0},{"$f":"'Resources management'!N211","v":"00:00:00"},null,0,{"$f":"IF(R56=1,SUM($R$34:R56),\"\")","v":""}]
["Scope Management",1,null,null,null,null,{"$f":"_xlfn.CONCAT($M$6,A57,$M$5,B58,$M$5,B59,$M$5,B60,$M$5,B61,$M$5,B62,$M$5,B63,$M$5,B64,$M$7)","v":"[Scope Management_1_1_1_1_1_1_1]"},null,null,null,null,null,"Resources management",12,{"$f":"'Resources management'!E212","v":0},{"$f":"'Resources management'!N212","v":"00:00:00"},null,0,{"$f":"IF(R57=1,SUM($R$34:R57),\"\")","v":""}]
["Importance ",1,{"$f":"IF(B58=1,1,B58-1)","v":1},{"$f":"SUM(B58:B64)","v":7},{"$f":"IF(D58=7,\"Not started\",\"In progress\")","v":"Not started"},null,null,null,null,null,null,null,"Professionalism ",1,{"$f":"Professionalism!E196","v":0},{"$f":"Professionalism!N196","v":"00:00:00"},null,0,{"$f":"IF(R58=1,SUM($R$34:R58),\"\")","v":""}]
["Level 1 - Knowledge",1,0,null,null,null,null,null,null,null,null,null,"Professionalism ",2,{"$f":"Professionalism!E197","v":0},{"$f":"Professionalism!N197","v":"00:00:00"},null,0,{"$f":"IF(R59=1,SUM($R$34:R59),\"\")","v":""}]
["Level 1 - Experience ",1,0,null,null,null,null,null,null,null,null,null,"Professionalism ",3,{"$f":"Professionalism!E198","v":0},{"$f":"Professionalism!N198","v":"00:00:00"},null,0,{"$f":"IF(R60=1,SUM($R$34:R60),\"\")","v":""}]
["Level 2 - Knowledge",1,0,null,null,null,null,null,null,null,null,null,"Professionalism ",4,{"$f":"Professionalism!E199","v":0},{"$f":"Professionalism!N199","v":"00:00:00"},null,0,{"$f":"IF(R61=1,SUM($R$34:R61),\"\")","v":""}]
["Level 2 - Experience",1,0,null,null,null,null,null,null,null,null,null,"Professionalism ",5,{"$f":"Professionalism!E200","v":0},{"$f":"Professionalism!N200","v":"00:00:00"},null,0,{"$f":"IF(R62=1,SUM($R$34:R62),\"\")","v":""}]
["Level 3  -Knowledge",1,0,null,null,null,null,null,null,null,null,null,"Professionalism ",6,{"$f":"Professionalism!E201","v":0},{"$f":"Professionalism!N201","v":"00:00:00"},null,0,{"$f":"IF(R63=1,SUM($R$34:R63),\"\")","v":""}]
["Level 3 - Experience",1,0,null,null,null,null,null,null,null,null,null,"Professionalism ",7,{"$f":"Professionalism!E202","v":0},{"$f":"Professionalism!N202","v":"00:00:00"},null,0,{"$f":"IF(R64=1,SUM($R$34:R64),\"\")","v":""}]
["Risk and Issue Management",1,null,null,null,null,{"$f":"_xlfn.CONCAT($M$6,A65,$M$5,B66,$M$5,B67,$M$5,B68,$M$5,B69,$M$5,B70,$M$5,B71,$M$5,B72,$M$7)","v":"[Risk and Issue Management_1_1_1_1_1_1_1]"},null,null,null,null,null,"Professionalism ",8,{"$f":"Professionalism!E203","v":0},{"$f":"Professionalism!N203","v":"00:00:00"},null,0,{"$f":"IF(R65=1,SUM($R$34:R65),\"\")","v":""}]
["Importance ",1,{"$f":"IF(B66=1,1,B66-1)","v":1},{"$f":"SUM(B66:B72)","v":7},{"$f":"IF(D66=7,\"Not started\",\"In progress\")","v":"Not started"},null,null,null,null,null,null,null,"Professionalism ",9,{"$f":"Professionalism!E204","v":0},{"$f":"Professionalism!N204","v":"00:00:00"},null,0,{"$f":"IF(R66=1,SUM($R$34:R66),\"\")","v":""}]
["Level 1 - Knowledge",1,0,null,null,null,null,null,null,null,null,null,"Professionalism ",10,{"$f":"Professionalism!E205","v":0},{"$f":"Professionalism!N205","v":"00:00:00"},null,0,{"$f":"IF(R67=1,SUM($R$34:R67),\"\")","v":""}]
["Level 1 - Experience ",1,0,null,null,null,null,null,null,null,null,null,"Professionalism ",11,{"$f":"Professionalism!E206","v":0},{"$f":"Professionalism!N206","v":"00:00:00"},null,0,{"$f":"IF(R68=1,SUM($R$34:R68),\"\")","v":""}]
["Level 2 - Knowledge",1,0,null,null,null,null,null,null,null,null,null,"Professionalism ",12,{"$f":"Professionalism!E207","v":0},{"$f":"Professionalism!N207","v":"00:00:00"},null,0,{"$f":"IF(R69=1,SUM($R$34:R69),\"\")","v":""}]
["Level 2 - Experience",1,0,null,null,null,null,null,null,null,null,null,"Project Delivery",1,{"$f":"'Project delivery'!E209","v":0},{"$f":"'Project delivery'!N209","v":"00:00:00"},null,0,{"$f":"IF(R70=1,SUM($R$34:R70),\"\")","v":""}]
["Level 3  -Knowledge",1,0,null,null,null,null,null,null,null,null,null,"Project Delivery",2,{"$f":"'Project delivery'!E210","v":0},{"$f":"'Project delivery'!N210","v":"00:00:00"},null,0,{"$f":"IF(R71=1,SUM($R$34:R71),\"\")","v":""}]
["Level 3 - Experience",1,0,null,null,null,null,null,null,null,null,null,"Project Delivery",3,{"$f":"'Project delivery'!E211","v":0},{"$f":"'Project delivery'!N211","v":"00:00:00"},null,0,{"$f":"IF(R72=1,SUM($R$34:R72),\"\")","v":""}]
["Project Finances",1,null,null,null,null,{"$f":"_xlfn.CONCAT($M$6,A73,$M$5,B74,$M$5,B75,$M$5,B76,$M$5,B77,$M$5,B78,$M$5,B79,$M$5,B80,$M$7)","v":"[Project Finances_1_1_1_1_1_1_1]"},null,null,null,null,null,"Project Delivery",4,{"$f":"'Project delivery'!E212","v":0},{"$f":"'Project delivery'!N212","v":"00:00:00"},null,0,{"$f":"IF(R73=1,SUM($R$34:R73),\"\")","v":""}]
["Importance ",1,{"$f":"IF(B74=1,1,B74-1)","v":1},{"$f":"SUM(B74:B80)","v":7},{"$f":"IF(D74=7,\"Not started\",\"In progress\")","v":"Not started"},null,null,null,null,null,null,null,"Project Delivery",5,{"$f":"'Project delivery'!E213","v":0},{"$f":"'Project delivery'!N213","v":"00:00:00"},null,0,{"$f":"IF(R74=1,SUM($R$34:R74),\"\")","v":""}]
["Level 1 - Knowledge",1,0,null,null,null,null,null,null,null,null,null,"Project Delivery",6,{"$f":"'Project delivery'!E214","v":0},{"$f":"'Project delivery'!N214","v":"00:00:00"},null,0,{"$f":"IF(R75=1,SUM($R$34:R75),\"\")","v":""}]
["Level 1 - Experience ",1,0,null,null,null,null,null,null,null,null,null,"Project Delivery",7,{"$f":"'Project delivery'!E215","v":0},{"$f":"'Project delivery'!N215","v":"00:00:00"},null,0,{"$f":"IF(R76=1,SUM($R$34:R76),\"\")","v":""}]
["Level 2 - Knowledge",1,0,null,null,null,null,null,null,null,null,null,"Project Delivery",8,{"$f":"'Project delivery'!E216","v":0},{"$f":"'Project delivery'!N216","v":"00:00:00"},null,0,{"$f":"IF(R77=1,SUM($R$34:R77),\"\")","v":""}]
["Level 2 - Experience",1,0,null,null,null,null,null,null,null,null,null,"Project Delivery",9,{"$f":"'Project delivery'!E217","v":0},{"$f":"'Project delivery'!N217","v":"00:00:00"},null,0,{"$f":"IF(R78=1,SUM($R$34:R78),\"\")","v":""}]
["Level 3  -Knowledge",1,0,null,null,null,null,null,null,null,null,null,"Project Delivery",10,{"$f":"'Project delivery'!E218","v":0},{"$f":"'Project delivery'!N218","v":"00:00:00"},null,0,{"$f":"IF(R79=1,SUM($R$34:R79),\"\")","v":""}]
["Level 3 - Experience",1,0,null,null,null,null,null,null,null,null,null,"Project Delivery",11,{"$f":"'Project delivery'!E219","v":0},{"$f":"'Project delivery'!N219","v":"00:00:00"},null,0,{"$f":"IF(R80=1,SUM($R$34:R80),\"\")","v":""}]
["Project Structure and Governance",1,null,null,null,null,{"$f":"_xlfn.CONCAT($M$6,A81,$M$5,B82,$M$5,B83,$M$5,B84,$M$5,B85,$M$5,B86,$M$5,B87,$M$5,B88,$M$7)","v":"[Project Structure and Governance_1_1_1_1_1_1_1]"},null,null,null,null,null,"Project Delivery",12,{"$f":"'Project delivery'!E220","v":0},{"$f":"'Project delivery'!N220","v":"00:00:00"},null,0,{"$f":"IF(R81=1,SUM($R$34:R81),\"\")","v":""}]
["Importance ",1,{"$f":"IF(B82=1,1,B82-1)","v":1},{"$f":"SUM(B82:B88)","v":7},{"$f":"IF(D82=7,\"Not started\",\"In progress\")","v":"Not started"},null,null,null,null,null,null,null,"Communication Management",1,{"$f":"'Communication management'!E200","v":0},{"$f":"'Communication management'!N200","v":"00:00:00"},null,0,{"$f":"IF(R82=1,SUM($R$34:R82),\"\")","v":""}]
["Level 1 - Knowledge",1,{"$f":"IF(B83<3,0,B83-2)","v":0},null,null,null,null,null,null,null,null,null,"Communication Management",2,{"$f":"'Communication management'!E201","v":0},{"$f":"'Communication management'!N201","v":"00:00:00"},null,0,{"$f":"IF(R83=1,SUM($R$34:R83),\"\")","v":""}]
["Level 1 - Experience ",1,0,null,null,null,null,null,null,null,null,null,"Communication Management",3,{"$f":"'Communication management'!E202","v":0},{"$f":"'Communication management'!N202","v":"00:00:00"},null,0,{"$f":"IF(R84=1,SUM($R$34:R84),\"\")","v":""}]
["Level 2 - Knowledge",1,0,null,null,null,null,null,null,null,null,null,"Communication Management",4,{"$f":"'Communication management'!E203","v":0},{"$f":"'Communication management'!N203","v":"00:00:00"},null,0,{"$f":"IF(R85=1,SUM($R$34:R85),\"\")","v":""}]
["Level 2 - Experience",1,0,null,null,null,null,null,null,null,null,null,"Communication Management",5,{"$f":"'Communication management'!E204","v":0},{"$f":"'Communication management'!N204","v":"00:00:00"},null,0,{"$f":"IF(R86=1,SUM($R$34:R86),\"\")","v":""}]
["Level 3  -Knowledge",1,0,null,null,null,null,null,null,null,null,null,"Communication Management",6,{"$f":"'Communication management'!E205","v":0},{"$f":"'Communication management'!N205","v":"00:00:00"},null,0,{"$f":"IF(R87=1,SUM($R$34:R87),\"\")","v":""}]
["Level 3 - Experience",1,0,null,null,null,null,null,null,null,null,null,"Communication Management",7,{"$f":"'Communication management'!E206","v":0},{"$f":"'Communication management'!N206","v":"00:00:00"},null,0,{"$f":"IF(R88=1,SUM($R$34:R88),\"\")","v":""}]
["Quality Management and Assurance",1,null,null,null,null,{"$f":"_xlfn.CONCAT($M$6,A89,$M$5,B90,$M$5,B91,$M$5,B92,$M$5,B93,$M$5,B94,$M$5,B95,$M$5,B96,$M$7)","v":"[Quality Management and Assurance_1_1_1_1_1_1_1]"},null,null,null,null,null,"Communication Management",8,{"$f":"'Communication management'!E207","v":0},{"$f":"'Communication management'!N207","v":"00:00:00"},null,0,{"$f":"IF(R89=1,SUM($R$34:R89),\"\")","v":""}]
["Importance ",1,{"$f":"IF(B90=1,1,B90-1)","v":1},{"$f":"SUM(B90:B96)","v":7},{"$f":"IF(D90=7,\"Not started\",\"In progress\")","v":"Not started"},null,null,null,null,null,null,null,"Communication Management",9,{"$f":"'Communication management'!E208","v":0},{"$f":"'Communication management'!N208","v":"00:00:00"},null,0,{"$f":"IF(R90=1,SUM($R$34:R90),\"\")","v":""}]
["Level 1 - Knowledge",1,{"$f":"IF(B91<3,0,B91-2)","v":0},null,null,null,null,null,null,null,null,null,"Communication Management",10,{"$f":"'Communication management'!E209","v":0},{"$f":"'Communication management'!N209","v":"00:00:00"},null,0,{"$f":"IF(R91=1,SUM($R$34:R91),\"\")","v":""}]
["Level 1 - Experience ",1,0,null,null,null,null,null,null,null,null,null,"Communication Management",11,{"$f":"'Communication management'!E210","v":0},{"$f":"'Communication management'!N210","v":"00:00:00"},null,0,{"$f":"IF(R92=1,SUM($R$34:R92),\"\")","v":""}]
["Level 2 - Knowledge",1,0,null,null,null,null,null,null,null,null,null,"Communication Management",12,{"$f":"'Communication management'!E211","v":0},{"$f":"'Communication management'!N211","v":"00:00:00"},null,0,{"$f":"IF(R93=1,SUM($R$34:R93),\"\")","v":""}]
["Level 2 - Experience",1,0,null,null,null,null,null,null,null,null,null,"Conflict Management",1,{"$f":"'Conflict management'!E199","v":0},{"$f":"'Conflict management'!N199","v":"00:00:00"},null,0,{"$f":"IF(R94=1,SUM($R$34:R94),\"\")","v":""}]
["Level 3  -Knowledge",1,0,null,null,null,null,null,null,null,null,null,"Conflict Management",2,{"$f":"'Conflict management'!E200","v":0},{"$f":"'Conflict management'!N200","v":"00:00:00"},null,0,{"$f":"IF(R95=1,SUM($R$34:R95),\"\")","v":""}]
["Level 3 - Experience",1,0,null,null,null,null,null,null,null,null,null,"Conflict Management",3,{"$f":"'Conflict management'!E201","v":0},{"$f":"'Conflict management'!N201","v":"00:00:00"},null,0,{"$f":"IF(R96=1,SUM($R$34:R96),\"\")","v":""}]
[null,null,null,null,null,null,null,null,null,null,null,null,"Conflict Management",4,{"$f":"'Conflict management'!E202","v":0},{"$f":"'Conflict management'!N202","v":"00:00:00"},null,0,{"$f":"IF(R97=1,SUM($R$34:R97),\"\")","v":""}]
["Completion",null,null,null,null,null,null,null,null,null,null,null,"Conflict Management",5,{"$f":"'Conflict management'!E203","v":0},{"$f":"'Conflict management'!N203","v":"00:00:00"},null,0,{"$f":"IF(R98=1,SUM($R$34:R98),\"\")","v":""}]
["Leadership",false,{"$f":"IF(B99=TRUE,\"Complete\",E2)","v":"Not started"},null,null,null,null,null,null,null,null,null,"Conflict Management",6,{"$f":"'Conflict management'!E204","v":0},{"$f":"'Conflict management'!N204","v":"00:00:00"},null,{"$f":"IF(O99=0,0,1)","v":0},{"$f":"IF(R99=1,SUM($R$34:R99),\"\")","v":""}]
["Resource",false,{"$f":"IF(B100=TRUE,\"Complete\",E10)","v":"Not started"},null,null,null,null,null,null,null,null,null,"Conflict Management",7,{"$f":"'Conflict management'!E205","v":0},{"$f":"'Conflict management'!N205","v":"00:00:00"},null,0,{"$f":"IF(R100=1,SUM($R$34:R100),\"\")","v":""}]
["Professionalism",false,{"$f":"IF(B101=TRUE,\"Complete\",E18)","v":"Not started"},null,null,null,null,null,null,null,null,null,"Conflict Management",8,{"$f":"'Conflict management'!E206","v":0},{"$f":"'Conflict management'!N206","v":"00:00:00"},null,0,{"$f":"IF(R101=1,SUM($R$34:R101),\"\")","v":""}]
["Project Delivery",false,{"$f":"IF(B102=TRUE,\"Complete\",E26)","v":"Not started"},null,null,null,null,null,null,null,null,null,"Conflict Management",9,{"$f":"'Conflict management'!E207","v":0},{"$f":"'Conflict management'!N207","v":"00:00:00"},null,0,{"$f":"IF(R102=1,SUM($R$34:R102),\"\")","v":""}]
["Comm",false,{"$f":"IF(B103=TRUE,\"Complete\",E34)","v":"Not started"},null,null,null,null,null,null,null,null,null,"Conflict Management",10,{"$f":"'Conflict management'!E208","v":0},{"$f":"'Conflict management'!N208","v":"00:00:00"},null,0,{"$f":"IF(R103=1,SUM($R$34:R103),\"\")","v":""}]
["Conflict",false,{"$f":"IF(B104=TRUE,\"Complete\",E42)","v":"Not started"},null,null,null,null,null,null,null,null,null,"Conflict Management",11,{"$f":"'Conflict management'!E209","v":0},{"$f":"'Conflict management'!N209","v":"00:00:00"},null,0,{"$f":"IF(R104=1,SUM($R$34:R104),\"\")","v":""}]
["Planning ",false,{"$f":"IF(B105=TRUE,\"Complete\",E50)","v":"Not started"},null,null,null,null,null,null,null,null,null,"Conflict Management",12,{"$f":"'Conflict management'!E210","v":0},{"$f":"'Conflict management'!N210","v":"00:00:00"},null,0,{"$f":"IF(R105=1,SUM($R$34:R105),\"\")","v":""}]
["Scope",false,{"$f":"IF(B106=TRUE,\"Complete\",E58)","v":"Not started"},null,null,null,null,null,null,null,null,null,"Planning for success",1,{"$f":"'Planning for success'!E203","v":0},{"$f":"'Planning for success'!N203","v":"00:00:00"},null,0,{"$f":"IF(R106=1,SUM($R$34:R106),\"\")","v":""}]
["Risk",false,{"$f":"IF(B107=TRUE,\"Complete\",E66)","v":"Not started"},null,null,null,null,null,null,null,null,null,"Planning for success",2,{"$f":"'Planning for success'!E204","v":0},{"$f":"'Planning for success'!N204","v":"00:00:00"},null,0,{"$f":"IF(R107=1,SUM($R$34:R107),\"\")","v":""}]
["Finance",false,{"$f":"IF(B108=TRUE,\"Complete\",E74)","v":"Not started"},null,null,null,null,null,null,null,null,null,"Planning for success",3,{"$f":"'Planning for success'!E205","v":0},{"$f":"'Planning for success'!N205","v":"00:00:00"},null,0,{"$f":"IF(R108=1,SUM($R$34:R108),\"\")","v":""}]
["Structure and Governance",false,{"$f":"IF(B109=TRUE,\"Complete\",E82)","v":"Not started"},null,null,null,null,null,null,null,null,null,"Planning for success",4,{"$f":"'Planning for success'!E206","v":0},{"$f":"'Planning for success'!N206","v":"00:00:00"},null,0,{"$f":"IF(R109=1,SUM($R$34:R109),\"\")","v":""}]
["Quality ",false,{"$f":"IF(B110=TRUE,\"Complete\",E90)","v":"Not started"},null,null,null,null,null,null,null,null,null,"Planning for success",5,{"$f":"'Planning for success'!E207","v":0},{"$f":"'Planning for success'!N207","v":"00:00:00"},null,0,{"$f":"IF(R110=1,SUM($R$34:R110),\"\")","v":""}]
["About you",false,{"$f":"IF(B111=TRUE,\"Complete\",\"Not started\")","v":"Not started"},null,null,null,null,null,null,null,null,null,"Planning for success",6,{"$f":"'Planning for success'!E208","v":0},{"$f":"'Planning for success'!N208","v":"00:00:00"},null,0,{"$f":"IF(R111=1,SUM($R$34:R111),\"\")","v":""}]
[null,null,null,null,null,null,null,null,null,null,null,null,"Planning for success",7,{"$f":"'Planning for success'!E209","v":0},{"$f":"'Planning for success'!N209","v":"00:00:00"},null,0,{"$f":"IF(R112=1,SUM($R$34:R112),\"\")","v":""}]
["Complete",{"$f":"COUNTIF(B99:B111,TRUE)","v":0},null,null,null,null,null,null,null,null,null,null,"Planning for success",8,{"$f":"'Planning for success'!E210","v":0},{"$f":"'Planning for success'!N210","v":"00:00:00"},null,0,{"$f":"IF(R113=1,SUM($R$34:R113),\"\")","v":""}]
[null,null,null,null,null,null,{"$f":"_xlfn.CONCAT(O20,$M$8,O21,$M$8,O22,$M$8,O23,$M$8,O24,$M$8,O25,$M$8,O26,$M$8,O27,$M$8,O28,$M$8,O29,$M$8,O30)","v":"[First Name_First Name] [Surname_Last Name] [Email_Enter your Email Address Here] [Role_Please Select From Drop Down List] [Role-Other_0] [ORG_Please select from drop down list] [ORG-Other_0] [Career_Please Select From Drop Down List] [Role-length_Please Select From Drop Down List] [Experience_Please select from drop down list] [Training_]"},null,null,null,null,null,"Planning for success",9,{"$f":"'Planning for success'!E211","v":0},{"$f":"'Planning for success'!N211","v":"00:00:00"},null,0,{"$f":"IF(R114=1,SUM($R$34:R114),\"\")","v":""}]
[null,null,null,null,null,null,{"$f":"_xlfn.CONCAT(G1,$M$8,G9,$M$8,G18,$M$8,G25,$M$8,G33,$M$8,G41,$M$8,G49,$M$8,G57,$M$8,G65,$M$8,G73,$M$8,G81,$M$8,G89)","v":"[Leadership and team management _1_1_1_1_1_1_1] [Resources Management_1_1_1_1_1_1_1] [Importance _1_1_1_1_1_1_1] [Project Delivery_1_1_1_1_1_1_1] [Communication Management_1_1_1_1_1_1_1] [Conflict Management_1_1_1_1_1_1_1] [Planning for success_1_1_1_1_1_1_1] [Scope Management_1_1_1_1_1_1_1] [Risk and Issue Management_1_1_1_1_1_1_1] [Project Finances_1_1_1_1_1_1_1] [Project Structure and Governance_1_1_1_1_1_1_1] [Quality Management and Assurance_1_1_1_1_1_1_1]"},null,null,null,null,null,"Planning for success",10,{"$f":"'Planning for success'!E212","v":0},{"$f":"'Planning for success'!N212","v":"00:00:00"},null,0,{"$f":"IF(R115=1,SUM($R$34:R115),\"\")","v":""}]
[null,null,null,null,null,null,{"$f":"_xlfn.CONCAT($M$6,M180,$M$5,N180,$M$7)","v":"[Number of Actions Completed_1]"},null,null,null,null,null,"Planning for success",11,{"$f":"'Planning for success'!E213","v":0},{"$f":"'Planning for success'!N213","v":"00:00:00"},null,0,{"$f":"IF(R116=1,SUM($R$34:R116),\"\")","v":""}]
[null,null,null,null,null,null,null,null,null,null,null,null,"Planning for success",12,{"$f":"'Planning for success'!E214","v":0},{"$f":"'Planning for success'!N214","v":"00:00:00"},null,0,{"$f":"IF(R117=1,SUM($R$34:R117),\"\")","v":""}]
[null,null,null,null,null,null,null,null,null,null,null,null,"Scope Management",1,{"$f":"'Scope management'!E195","v":0},{"$f":"'Scope management'!N195","v":"00:00:00"},null,0,{"$f":"IF(R118=1,SUM($R$34:R118),\"\")","v":""}]
[null,null,null,null,null,null,null,null,null,null,null,null,"Scope Management",2,{"$f":"'Scope management'!E196","v":0},{"$f":"'Scope management'!N196","v":"00:00:00"},null,0,{"$f":"IF(R119=1,SUM($R$34:R119),\"\")","v":""}]
[null,null,null,null,null,null,{"$f":"_xlfn.CONCAT(G114,$M$8,G115,$M$8,G116)","v":"[First Name_First Name] [Surname_Last Name] [Email_Enter your Email Address Here] [Role_Please Select From Drop Down List] [Role-Other_0] [ORG_Please select from drop down list] [ORG-Other_0] [Career_Please Select From Drop Down List] [Role-length_Please Select From Drop Down List] [Experience_Please select from drop down list] [Training_] [Leadership and team management _1_1_1_1_1_1_1] [Resources Management_1_1_1_1_1_1_1] [Importance _1_1_1_1_1_1_1] [Project Delivery_1_1_1_1_1_1_1] [Communication Management_1_1_1_1_1_1_1] [Conflict Management_1_1_1_1_1_1_1] [Planning for success_1_1_1_1_1_1_1] [Scope Management_1_1_1_1_1_1_1] [Risk and Issue Management_1_1_1_1_1_1_1] [Project Finances_1_1_1_1_1_1_1] [Project Structure and Governance_1_1_1_1_1_1_1] [Quality Management and Assurance_1_1_1_1_1_1_1] [Number of Actions Completed_1]"},null,null,null,null,null,"Scope Management",3,{"$f":"'Scope management'!E197","v":0},{"$f":"'Scope management'!N197","v":"00:00:00"},null,0,{"$f":"IF(R120=1,SUM($R$34:R120),\"\")","v":""}]
[null,null,null,null,null,null,null,null,null,null,null,null,"Scope Management",4,{"$f":"'Scope management'!E198","v":0},{"$f":"'Scope management'!N198","v":"00:00:00"},null,0,{"$f":"IF(R121=1,SUM($R$34:R121),\"\")","v":""}]
[null,null,null,null,null,null,null,null,null,null,null,null,"Scope Management",5,{"$f":"'Scope management'!E199","v":0},{"$f":"'Scope management'!N199","v":"00:00:00"},null,0,{"$f":"IF(R122=1,SUM($R$34:R122),\"\")","v":""}]
[null,null,null,null,null,null,null,null,null,null,null,null,"Scope Management",6,{"$f":"'Scope management'!E200","v":0},{"$f":"'Scope management'!N200","v":"00:00:00"},null,0,{"$f":"IF(R123=1,SUM($R$34:R123),\"\")","v":""}]
[null,null,null,null,null,null,null,null,null,null,null,null,"Scope Management",7,{"$f":"'Scope management'!E201","v":0},{"$f":"'Scope management'!N201","v":"00:00:00"},null,0,{"$f":"IF(R124=1,SUM($R$34:R124),\"\")","v":""}]
[null,null,null,null,null,null,null,null,null,null,null,null,"Scope Management",8,{"$f":"'Scope management'!E202","v":0},{"$f":"'Scope management'!N202","v":"00:00:00"},null,0,{"$f":"IF(R125=1,SUM($R$34:R125),\"\")","v":""}]
[null,null,null,null,null,null,null,null,null,null,null,null,"Scope Management",9,{"$f":"'Scope management'!E203","v":0},{"$f":"'Scope management'!N203","v":"00:00:00"},null,0,{"$f":"IF(R126=1,SUM($R$34:R126),\"\")","v":""}]
[null,null,null,null,null,null,null,null,null,null,null,null,"Scope Management",10,{"$f":"'Scope management'!E204","v":0},{"$f":"'Scope management'!N204","v":"00:00:00"},null,0,{"$f":"IF(R127=1,SUM($R$34:R127),\"\")","v":""}]
[null,null,null,null,null,null,null,null,null,null,null,null,"Scope Management",11,{"$f":"'Scope management'!E205","v":0},{"$f":"'Scope management'!N205","v":"00:00:00"},null,0,{"$f":"IF(R128=1,SUM($R$34:R128),\"\")","v":""}]
[null,null,null,null,null,null,null,null,null,null,null,null,"Scope Management",12,{"$f":"'Scope management'!E206","v":0},{"$f":"'Scope management'!N206","v":"00:00:00"},null,0,{"$f":"IF(R129=1,SUM($R$34:R129),\"\")","v":""}]
[null,null,null,null,null,null,null,null,null,null,null,null,"Risk and Issue Management",1,{"$f":"'Risk and issue management'!E206","v":0},{"$f":"'Risk and issue management'!N206","v":"00:00:00"},null,0,{"$f":"IF(R130=1,SUM($R$34:R130),\"\")","v":""}]
[null,null,null,null,null,null,null,null,null,null,null,null,"Risk and Issue Management",2,{"$f":"'Risk and issue management'!E207","v":0},{"$f":"'Risk and issue management'!N207","v":"00:00:00"},null,0,{"$f":"IF(R131=1,SUM($R$34:R131),\"\")","v":""}]
[null,null,null,null,null,null,null,null,null,null,null,null,"Risk and Issue Management",3,{"$f":"'Risk and issue management'!E208","v":0},{"$f":"'Risk and issue management'!N208","v":"00:00:00"},null,0,{"$f":"IF(R132=1,SUM($R$34:R132),\"\")","v":""}]
[null,null,null,null,null,null,null,null,null,null,null,null,"Risk and Issue Management",4,{"$f":"'Risk and issue management'!E209","v":0},{"$f":"'Risk and issue management'!N209","v":"00:00:00"},null,0,{"$f":"IF(R133=1,SUM($R$34:R133),\"\")","v":""}]
[null,null,null,null,null,null,null,null,null,null,null,null,"Risk and Issue Management",5,{"$f":"'Risk and issue management'!E210","v":0},{"$f":"'Risk and issue management'!N210","v":"00:00:00"},null,0,{"$f":"IF(R134=1,SUM($R$34:R134),\"\")","v":""}]
[null,null,null,null,null,null,null,null,null,null,null,null,"Risk and Issue Management",6,{"$f":"'Risk and issue management'!E211","v":0},{"$f":"'Risk and issue management'!N211","v":"00:00:00"},null,0,{"$f":"IF(R135=1,SUM($R$34:R135),\"\")","v":""}]
[null,null,null,null,null,null,null,null,null,null,null,null,"Risk and Issue Management",7,{"$f":"'Risk and issue management'!E212","v":0},{"$f":"'Risk and issue management'!N212","v":"00:00:00"},null,0,{"$f":"IF(R136=1,SUM($R$34:R136),\"\")","v":""}]
[null,null,null,null,null,null,null,null,null,null,null,null,"Risk and Issue Management",8,{"$f":"'Risk and issue management'!E213","v":0},{"$f":"'Risk and issue management'!N213","v":"00:00:00"},null,0,{"$f":"IF(R137=1,SUM($R$34:R137),\"\")","v":""}]
[null,null,null,null,null,null,null,null,null,null,null,null,"Risk and Issue Management",9,{"$f":"'Risk and issue management'!E214","v":0},{"$f":"'Risk and issue management'!N214","v":"00:00:00"},null,0,{"$f":"IF(R138=1,SUM($R$34:R138),\"\")","v":""}]
[null,null,null,null,null,null,null,null,null,null,null,null,"Risk and Issue Management",10,{"$f":"'Risk and issue management'!E215","v":0},{"$f":"'Risk and issue management'!N215","v":"00:00:00"},null,0,{"$f":"IF(R139=1,SUM($R$34:R139),\"\")","v":""}]
[null,null,null,null,null,null,null,null,null,null,null,null,"Risk and Issue Management",11,{"$f":"'Risk and issue management'!E216","v":0},{"$f":"'Risk and issue management'!N216","v":"00:00:00"},null,0,{"$f":"IF(R140=1,SUM($R$34:R140),\"\")","v":""}]
[null,null,null,null,null,null,null,null,null,null,null,null,"Risk and Issue Management",12,{"$f":"'Risk and issue management'!E217","v":0},{"$f":"'Risk and issue management'!N217","v":"00:00:00"},null,0,{"$f":"IF(R141=1,SUM($R$34:R141),\"\")","v":""}]
[null,null,null,null,null,null,null,null,null,null,null,null,"Project Finances",1,{"$f":"'Project finances'!E197","v":0},{"$f":"'Project finances'!N197","v":"00:00:00"},null,0,{"$f":"IF(R142=1,SUM($R$34:R142),\"\")","v":""}]
[null,null,null,null,null,null,null,null,null,null,null,null,"Project Finances",2,{"$f":"'Project finances'!E198","v":0},{"$f":"'Project finances'!N198","v":"00:00:00"},null,0,{"$f":"IF(R143=1,SUM($R$34:R143),\"\")","v":""}]
[null,null,null,null,null,null,null,null,null,null,null,null,"Project Finances",3,{"$f":"'Project finances'!E199","v":0},{"$f":"'Project finances'!N199","v":"00:00:00"},null,0,{"$f":"IF(R144=1,SUM($R$34:R144),\"\")","v":""}]
[null,null,null,null,null,null,null,null,null,null,null,null,"Project Finances",4,{"$f":"'Project finances'!E200","v":0},{"$f":"'Project finances'!N200","v":"00:00:00"},null,0,{"$f":"IF(R145=1,SUM($R$34:R145),\"\")","v":""}]
[null,null,null,null,null,null,null,null,null,null,null,null,"Project Finances",5,{"$f":"'Project finances'!E201","v":0},{"$f":"'Project finances'!N201","v":"00:00:00"},null,0,{"$f":"IF(R146=1,SUM($R$34:R146),\"\")","v":""}]
[null,null,null,null,null,null,null,null,null,null,null,null,"Project Finances",6,{"$f":"'Project finances'!E202","v":0},{"$f":"'Project finances'!N202","v":"00:00:00"},null,0,{"$f":"IF(R147=1,SUM($R$34:R147),\"\")","v":""}]
[null,null,null,null,null,null,null,null,null,null,null,null,"Project Finances",7,{"$f":"'Project finances'!E203","v":0},{"$f":"'Project finances'!N203","v":"00:00:00"},null,0,{"$f":"IF(R148=1,SUM($R$34:R148),\"\")","v":""}]
[null,null,null,null,null,null,null,null,null,null,null,null,"Project Finances",8,{"$f":"'Project finances'!E204","v":0},{"$f":"'Project finances'!N204","v":"00:00:00"},null,0,{"$f":"IF(R149=1,SUM($R$34:R149),\"\")","v":""}]
[null,null,null,null,null,null,null,null,null,null,null,null,"Project Finances",9,{"$f":"'Project finances'!E205","v":0},{"$f":"'Project finances'!N205","v":"00:00:00"},null,0,{"$f":"IF(R150=1,SUM($R$34:R150),\"\")","v":""}]
[null,null,null,null,null,null,null,null,null,null,null,null,"Project Finances",10,{"$f":"'Project finances'!E206","v":0},{"$f":"'Project finances'!N206","v":"00:00:00"},null,0,{"$f":"IF(R151=1,SUM($R$34:R151),\"\")","v":""}]
[null,null,null,null,null,null,null,null,null,null,null,null,"Project Finances",11,{"$f":"'Project finances'!E207","v":0},{"$f":"'Project finances'!N207","v":"00:00:00"},null,0,{"$f":"IF(R152=1,SUM($R$34:R152),\"\")","v":""}]
[null,null,null,null,null,null,null,null,null,null,null,null,"Project Finances",12,{"$f":"'Project finances'!E208","v":0},{"$f":"'Project finances'!N208","v":"00:00:00"},null,0,{"$f":"IF(R153=1,SUM($R$34:R153),\"\")","v":""}]
[null,null,null,null,null,null,null,null,null,null,null,null,"Project Structure and Governance",1,{"$f":"'Project structure & governance'!E198","v":0},{"$f":"'Project structure & governance'!N198","v":"00:00:00"},null,0,{"$f":"IF(R154=1,SUM($R$34:R154),\"\")","v":""}]
[null,null,null,null,null,null,null,null,null,null,null,null,"Project Structure and Governance",2,{"$f":"'Project structure & governance'!E199","v":0},{"$f":"'Project structure & governance'!N199","v":"00:00:00"},null,0,{"$f":"IF(R155=1,SUM($R$34:R155),\"\")","v":""}]
[null,null,null,null,null,null,null,null,null,null,null,null,"Project Structure and Governance",3,{"$f":"'Project structure & governance'!E200","v":0},{"$f":"'Project structure & governance'!N200","v":"00:00:00"},null,0,{"$f":"IF(R156=1,SUM($R$34:R156),\"\")","v":""}]
[null,null,null,null,null,null,null,null,null,null,null,null,"Project Structure and Governance",4,{"$f":"'Project structure & governance'!E201","v":0},{"$f":"'Project structure & governance'!N201","v":"00:00:00"},null,0,{"$f":"IF(R157=1,SUM($R$34:R157),\"\")","v":""}]
[null,null,null,null,null,null,null,null,null,null,null,null,"Project Structure and Governance",5,{"$f":"'Project structure & governance'!E202","v":0},{"$f":"'Project structure & governance'!N202","v":"00:00:00"},null,0,{"$f":"IF(R158=1,SUM($R$34:R158),\"\")","v":""}]
[null,null,null,null,null,null,null,null,null,null,null,null,"Project Structure and Governance",6,{"$f":"'Project structure & governance'!E203","v":0},{"$f":"'Project structure & governance'!N203","v":"00:00:00"},null,0,{"$f":"IF(R159=1,SUM($R$34:R159),\"\")","v":""}]
[null,null,null,null,null,null,null,null,null,null,null,null,"Project Structure and Governance",7,{"$f":"'Project structure & governance'!E204","v":0},{"$f":"'Project structure & governance'!N204","v":"00:00:00"},null,0,{"$f":"IF(R160=1,SUM($R$34:R160),\"\")","v":""}]
[null,null,null,null,null,null,null,null,null,null,null,null,"Project Structure and Governance",8,{"$f":"'Project structure & governance'!E205","v":0},{"$f":"'Project structure & governance'!N205","v":"00:00:00"},null,0,{"$f":"IF(R161=1,SUM($R$34:R161),\"\")","v":""}]
[null,null,null,null,null,null,null,null,null,null,null,null,"Project Structure and Governance",9,{"$f":"'Project structure & governance'!E206","v":0},{"$f":"'Project structure & governance'!N206","v":"00:00:00"},null,0,{"$f":"IF(R162=1,SUM($R$34:R162),\"\")","v":""}]
[null,null,null,null,null,null,null,null,null,null,null,null,"Project Structure and Governance",10,{"$f":"'Project structure & governance'!E207","v":0},{"$f":"'Project structure & governance'!N207","v":"00:00:00"},null,{"$f":"IF(O163=0,0,1)","v":0},{"$f":"IF(R163=1,SUM($R$34:R163),\"\")","v":""}]
[null,null,null,null,null,null,null,null,null,null,null,null,"Project Structure and Governance",11,{"$f":"'Project structure & governance'!E208","v":0},{"$f":"'Project structure & governance'!N208","v":"00:00:00"},null,0,{"$f":"IF(R164=1,SUM($R$34:R164),\"\")","v":""}]
[null,null,null,null,null,null,null,null,null,null,null,null,"Project Structure and Governance",12,{"$f":"'Project structure & governance'!E209","v":0},{"$f":"'Project structure & governance'!N209","v":"00:00:00"},null,0,{"$f":"IF(R165=1,SUM($R$34:R165),\"\")","v":""}]
[null,null,null,null,null,null,null,null,null,null,null,null,"Quality Management and Assurance",1,{"$f":"Quality!E195","v":0},{"$f":"Quality!N195","v":"00:00:00"},null,0,{"$f":"IF(R166=1,SUM($R$34:R166),\"\")","v":""}]
[null,null,null,null,null,null,null,null,null,null,null,null,"Quality Management and Assurance",2,{"$f":"Quality!E196","v":0},{"$f":"Quality!N196","v":"00:00:00"},null,0,{"$f":"IF(R167=1,SUM($R$34:R167),\"\")","v":""}]
[null,null,null,null,null,null,null,null,null,null,null,null,"Quality Management and Assurance",3,{"$f":"Quality!E197","v":0},{"$f":"Quality!N197","v":"00:00:00"},null,0,{"$f":"IF(R168=1,SUM($R$34:R168),\"\")","v":""}]
[null,null,null,null,null,null,null,null,null,null,null,null,"Quality Management and Assurance",4,{"$f":"Quality!E198","v":0},{"$f":"Quality!N198","v":"00:00:00"},null,0,{"$f":"IF(R169=1,SUM($R$34:R169),\"\")","v":""}]
[null,null,null,null,null,null,null,null,null,null,null,null,"Quality Management and Assurance",5,{"$f":"Quality!E199","v":0},{"$f":"Quality!N199","v":"00:00:00"},null,0,{"$f":"IF(R170=1,SUM($R$34:R170),\"\")","v":""}]
[null,null,null,null,null,null,null,null,null,null,null,null,"Quality Management and Assurance",6,{"$f":"Quality!E200","v":0},{"$f":"Quality!N200","v":"00:00:00"},null,0,{"$f":"IF(R171=1,SUM($R$34:R171),\"\")","v":""}]
[null,null,null,null,null,null,null,null,null,null,null,null,"Quality Management and Assurance",7,{"$f":"Quality!E201","v":0},{"$f":"Quality!N201","v":"00:00:00"},null,0,{"$f":"IF(R172=1,SUM($R$34:R172),\"\")","v":""}]
[null,null,null,null,null,null,null,null,null,null,null,null,"Quality Management and Assurance",8,{"$f":"Quality!E202","v":0},{"$f":"Quality!N202","v":"00:00:00"},null,0,{"$f":"IF(R173=1,SUM($R$34:R173),\"\")","v":""}]
[null,null,null,null,null,null,null,null,null,null,null,null,"Quality Management and Assurance",9,{"$f":"Quality!E203","v":0},{"$f":"Quality!N203","v":"00:00:00"},null,0,{"$f":"IF(R174=1,SUM($R$34:R174),\"\")","v":""}]
[null,null,null,null,null,null,null,null,null,null,null,null,"Quality Management and Assurance",10,{"$f":"Quality!E204","v":0},{"$f":"Quality!N204","v":"00:00:00"},null,0,{"$f":"IF(R175=1,SUM($R$34:R175),\"\")","v":""}]
[null,null,null,null,null,null,null,null,null,null,null,null,"Quality Management and Assurance",11,{"$f":"Quality!E205","v":0},{"$f":"Quality!N205","v":"00:00:00"},null,0,{"$f":"IF(R176=1,SUM($R$34:R176),\"\")","v":""}]
[null,null,null,null,null,null,null,null,null,null,null,null,"Quality Management and Assurance",12,{"$f":"Quality!E206","v":0},{"$f":"Quality!N206","v":"00:00:00"},null,0,{"$f":"IF(R177=1,SUM($R$34:R177),\"\")","v":""}]
[]
[]
[null,null,null,null,null,null,null,null,null,null,null,null,"Number of Actions Completed",{"$f":"144-COUNTIF(O34:O177,0)","v":1}]
[]
[]
[]
[]
[]
[]
[null,null,null,null,null,null,null,null,null,null,null,null,null,"Competency","Action/Objective","Deadline"]
[null,null,null,null,null,null,null,null,null,null,null,null,null,{"$f":"IFERROR(INDEX(Admin!$M$34:$P$177,MATCH(Results!$B147,Admin!$S$34:$S$177,0),1),\"\")","v":"Leadership and Team Management"},{"$f":"IFERROR(INDEX(Admin!$M$34:$P$177,MATCH(Results!$B147,Admin!$S$34:$S$177,0),3),\"\")","v":"e.g. I will aim to provide constructive peer feedback on at least one occasion within the next four weeks"},{"$f":"IFERROR(INDEX(Admin!$M$34:$P$177,MATCH(Results!$B147,Admin!$S$34:$S$177,0),4),\"\")","v":"2020-01-01"}]
[null,null,null,null,null,null,null,null,null,null,null,null,null,{"$f":"IFERROR(INDEX(Admin!$M$34:$P$177,MATCH(Results!$B148,Admin!$S$34:$S$177,0),1),\"\")","v":""},{"$f":"IFERROR(INDEX(Admin!$M$34:$P$177,MATCH(Results!$B148,Admin!$S$34:$S$177,0),3),\"\")","v":""},{"$f":"IFERROR(INDEX(Admin!$M$34:$P$177,MATCH(Results!$B148,Admin!$S$34:$S$177,0),4),\"\")","v":""}]
[null,null,null,null,null,null,null,null,null,null,null,null,null,{"$f":"IFERROR(INDEX(Admin!$M$34:$P$177,MATCH(Results!$B149,Admin!$S$34:$S$177,0),1),\"\")","v":""},{"$f":"IFERROR(INDEX(Admin!$M$34:$P$177,MATCH(Results!$B149,Admin!$S$34:$S$177,0),3),\"\")","v":""},{"$f":"IFERROR(INDEX(Admin!$M$34:$P$177,MATCH(Results!$B149,Admin!$S$34:$S$177,0),4),\"\")","v":""}]
[null,null,null,null,null,null,null,null,null,null,null,null,null,{"$f":"IFERROR(INDEX(Admin!$M$34:$P$177,MATCH(Results!$B150,Admin!$S$34:$S$177,0),1),\"\")","v":""},{"$f":"IFERROR(INDEX(Admin!$M$34:$P$177,MATCH(Results!$B150,Admin!$S$34:$S$177,0),3),\"\")","v":""},{"$f":"IFERROR(INDEX(Admin!$M$34:$P$177,MATCH(Results!$B150,Admin!$S$34:$S$177,0),4),\"\")","v":""}]
[null,null,null,null,null,null,null,null,null,null,null,null,null,{"$f":"IFERROR(INDEX(Admin!$M$34:$P$177,MATCH(Results!$B151,Admin!$S$34:$S$177,0),1),\"\")","v":""},{"$f":"IFERROR(INDEX(Admin!$M$34:$P$177,MATCH(Results!$B151,Admin!$S$34:$S$177,0),3),\"\")","v":""},{"$f":"IFERROR(INDEX(Admin!$M$34:$P$177,MATCH(Results!$B151,Admin!$S$34:$S$177,0),4),\"\")","v":""}]
[null,null,null,null,null,null,null,null,null,null,null,null,null,{"$f":"IFERROR(INDEX(Admin!$M$34:$P$177,MATCH(Results!$B152,Admin!$S$34:$S$177,0),1),\"\")","v":""},{"$f":"IFERROR(INDEX(Admin!$M$34:$P$177,MATCH(Results!$B152,Admin!$S$34:$S$177,0),3),\"\")","v":""},{"$f":"IFERROR(INDEX(Admin!$M$34:$P$177,MATCH(Results!$B152,Admin!$S$34:$S$177,0),4),\"\")","v":""}]
[null,null,null,null,null,null,null,null,null,null,null,null,null,{"$f":"IFERROR(INDEX(Admin!$M$34:$P$177,MATCH(Results!$B153,Admin!$S$34:$S$177,0),1),\"\")","v":""},{"$f":"IFERROR(INDEX(Admin!$M$34:$P$177,MATCH(Results!$B153,Admin!$S$34:$S$177,0),3),\"\")","v":""},{"$f":"IFERROR(INDEX(Admin!$M$34:$P$177,MATCH(Results!$B153,Admin!$S$34:$S$177,0),4),\"\")","v":""}]
[null,null,null,null,null,null,null,null,null,null,null,null,null,{"$f":"IFERROR(INDEX(Admin!$M$34:$P$177,MATCH(Results!$B154,Admin!$S$34:$S$177,0),1),\"\")","v":""},{"$f":"IFERROR(INDEX(Admin!$M$34:$P$177,MATCH(Results!$B154,Admin!$S$34:$S$177,0),3),\"\")","v":""},{"$f":"IFERROR(INDEX(Admin!$M$34:$P$177,MATCH(Results!$B154,Admin!$S$34:$S$177,0),4),\"\")","v":""}]
[null,null,null,null,null,null,null,null,null,null,null,null,null,{"$f":"IFERROR(INDEX(Admin!$M$34:$P$177,MATCH(Results!$B155,Admin!$S$34:$S$177,0),1),\"\")","v":""},{"$f":"IFERROR(INDEX(Admin!$M$34:$P$177,MATCH(Results!$B155,Admin!$S$34:$S$177,0),3),\"\")","v":""},{"$f":"IFERROR(INDEX(Admin!$M$34:$P$177,MATCH(Results!$B155,Admin!$S$34:$S$177,0),4),\"\")","v":""}]
[null,null,null,null,null,null,null,null,null,null,null,null,null,{"$f":"IFERROR(INDEX(Admin!$M$34:$P$177,MATCH(Results!$B156,Admin!$S$34:$S$177,0),1),\"\")","v":""},{"$f":"IFERROR(INDEX(Admin!$M$34:$P$177,MATCH(Results!$B156,Admin!$S$34:$S$177,0),3),\"\")","v":""},{"$f":"IFERROR(INDEX(Admin!$M$34:$P$177,MATCH(Results!$B156,Admin!$S$34:$S$177,0),4),\"\")","v":""}]
[null,null,null,null,null,null,null,null,null,null,null,null,null,{"$f":"IFERROR(INDEX(Admin!$M$34:$P$177,MATCH(Results!$B157,Admin!$S$34:$S$177,0),1),\"\")","v":""},{"$f":"IFERROR(INDEX(Admin!$M$34:$P$177,MATCH(Results!$B157,Admin!$S$34:$S$177,0),3),\"\")","v":""},{"$f":"IFERROR(INDEX(Admin!$M$34:$P$177,MATCH(Results!$B157,Admin!$S$34:$S$177,0),4),\"\")","v":""}]
[null,null,null,null,null,null,null,null,null,null,null,null,null,{"$f":"IFERROR(INDEX(Admin!$M$34:$P$177,MATCH(Results!$B158,Admin!$S$34:$S$177,0),1),\"\")","v":""},{"$f":"IFERROR(INDEX(Admin!$M$34:$P$177,MATCH(Results!$B158,Admin!$S$34:$S$177,0),3),\"\")","v":""},{"$f":"IFERROR(INDEX(Admin!$M$34:$P$177,MATCH(Results!$B158,Admin!$S$34:$S$177,0),4),\"\")","v":""}]
[null,null,null,null,null,null,null,null,null,null,null,null,null,{"$f":"IFERROR(INDEX(Admin!$M$34:$P$177,MATCH(Results!$B159,Admin!$S$34:$S$177,0),1),\"\")","v":""},{"$f":"IFERROR(INDEX(Admin!$M$34:$P$177,MATCH(Results!$B159,Admin!$S$34:$S$177,0),3),\"\")","v":""},{"$f":"IFERROR(INDEX(Admin!$M$34:$P$177,MATCH(Results!$B159,Admin!$S$34:$S$177,0),4),\"\")","v":""}]
[null,null,null,null,null,null,null,null,null,null,null,null,null,{"$f":"IFERROR(INDEX(Admin!$M$34:$P$177,MATCH(Results!$B160,Admin!$S$34:$S$177,0),1),\"\")","v":""},{"$f":"IFERROR(INDEX(Admin!$M$34:$P$177,MATCH(Results!$B160,Admin!$S$34:$S$177,0),3),\"\")","v":""},{"$f":"IFERROR(INDEX(Admin!$M$34:$P$177,MATCH(Results!$B160,Admin!$S$34:$S$177,0),4),\"\")","v":""}]
[null,null,null,null,null,null,null,null,null,null,null,null,null,{"$f":"IFERROR(INDEX(Admin!$M$34:$P$177,MATCH(Results!$B161,Admin!$S$34:$S$177,0),1),\"\")","v":""},{"$f":"IFERROR(INDEX(Admin!$M$34:$P$177,MATCH(Results!$B161,Admin!$S$34:$S$177,0),3),\"\")","v":""},{"$f":"IFERROR(INDEX(Admin!$M$34:$P$177,MATCH(Results!$B161,Admin!$S$34:$S$177,0),4),\"\")","v":""}]
[null,null,null,null,null,null,null,null,null,null,null,null,null,{"$f":"IFERROR(INDEX(Admin!$M$34:$P$177,MATCH(Results!$B162,Admin!$S$34:$S$177,0),1),\"\")","v":""},{"$f":"IFERROR(INDEX(Admin!$M$34:$P$177,MATCH(Results!$B162,Admin!$S$34:$S$177,0),3),\"\")","v":""},{"$f":"IFERROR(INDEX(Admin!$M$34:$P$177,MATCH(Results!$B162,Admin!$S$34:$S$177,0),4),\"\")","v":""}]
[null,null,null,null,null,null,null,null,null,null,null,null,null,{"$f":"IFERROR(INDEX(Admin!$M$34:$P$177,MATCH(Results!$B163,Admin!$S$34:$S$177,0),1),\"\")","v":""},{"$f":"IFERROR(INDEX(Admin!$M$34:$P$177,MATCH(Results!$B163,Admin!$S$34:$S$177,0),3),\"\")","v":""},{"$f":"IFERROR(INDEX(Admin!$M$34:$P$177,MATCH(Results!$B163,Admin!$S$34:$S$177,0),4),\"\")","v":""}]
[null,null,null,null,null,null,null,null,null,null,null,null,null,{"$f":"IFERROR(INDEX(Admin!$M$34:$P$177,MATCH(Results!$B164,Admin!$S$34:$S$177,0),1),\"\")","v":""},{"$f":"IFERROR(INDEX(Admin!$M$34:$P$177,MATCH(Results!$B164,Admin!$S$34:$S$177,0),3),\"\")","v":""},{"$f":"IFERROR(INDEX(Admin!$M$34:$P$177,MATCH(Results!$B164,Admin!$S$34:$S$177,0),4),\"\")","v":""}]
[null,null,null,null,null,null,null,null,null,null,null,null,null,{"$f":"IFERROR(INDEX(Admin!$M$34:$P$177,MATCH(Results!$B165,Admin!$S$34:$S$177,0),1),\"\")","v":""},{"$f":"IFERROR(INDEX(Admin!$M$34:$P$177,MATCH(Results!$B165,Admin!$S$34:$S$177,0),3),\"\")","v":""},{"$f":"IFERROR(INDEX(Admin!$M$34:$P$177,MATCH(Results!$B165,Admin!$S$34:$S$177,0),4),\"\")","v":""}]
[null,null,null,null,null,null,null,null,null,null,null,null,null,{"$f":"IFERROR(INDEX(Admin!$M$34:$P$177,MATCH(Results!$B166,Admin!$S$34:$S$177,0),1),\"\")","v":""},{"$f":"IFERROR(INDEX(Admin!$M$34:$P$177,MATCH(Results!$B166,Admin!$S$34:$S$177,0),3),\"\")","v":""},{"$f":"IFERROR(INDEX(Admin!$M$34:$P$177,MATCH(Results!$B166,Admin!$S$34:$S$177,0),4),\"\")","v":""}]
[null,null,null,null,null,null,null,null,null,null,null,null,null,{"$f":"IFERROR(INDEX(Admin!$M$34:$P$177,MATCH(Results!$B167,Admin!$S$34:$S$177,0),1),\"\")","v":""},{"$f":"IFERROR(INDEX(Admin!$M$34:$P$177,MATCH(Results!$B167,Admin!$S$34:$S$177,0),3),\"\")","v":""},{"$f":"IFERROR(INDEX(Admin!$M$34:$P$177,MATCH(Results!$B167,Admin!$S$34:$S$177,0),4),\"\")","v":""}]
[null,null,null,null,null,null,null,null,null,null,null,null,null,{"$f":"IFERROR(INDEX(Admin!$M$34:$P$177,MATCH(Results!$B168,Admin!$S$34:$S$177,0),1),\"\")","v":""},{"$f":"IFERROR(INDEX(Admin!$M$34:$P$177,MATCH(Results!$B168,Admin!$S$34:$S$177,0),3),\"\")","v":""},{"$f":"IFERROR(INDEX(Admin!$M$34:$P$177,MATCH(Results!$B168,Admin!$S$34:$S$177,0),4),\"\")","v":""}]
[null,null,null,null,null,null,null,null,null,null,null,null,null,{"$f":"IFERROR(INDEX(Admin!$M$34:$P$177,MATCH(Results!$B169,Admin!$S$34:$S$177,0),1),\"\")","v":""},{"$f":"IFERROR(INDEX(Admin!$M$34:$P$177,MATCH(Results!$B169,Admin!$S$34:$S$177,0),3),\"\")","v":""},{"$f":"IFERROR(INDEX(Admin!$M$34:$P$177,MATCH(Results!$B169,Admin!$S$34:$S$177,0),4),\"\")","v":""}]
[null,null,null,null,null,null,null,null,null,null,null,null,null,{"$f":"IFERROR(INDEX(Admin!$M$34:$P$177,MATCH(Results!$B170,Admin!$S$34:$S$177,0),1),\"\")","v":""},{"$f":"IFERROR(INDEX(Admin!$M$34:$P$177,MATCH(Results!$B170,Admin!$S$34:$S$177,0),3),\"\")","v":""},{"$f":"IFERROR(INDEX(Admin!$M$34:$P$177,MATCH(Results!$B170,Admin!$S$34:$S$177,0),4),\"\")","v":""}]
[null,null,null,null,null,null,null,null,null,null,null,null,null,{"$f":"IFERROR(INDEX(Admin!$M$34:$P$177,MATCH(Results!$B171,Admin!$S$34:$S$177,0),1),\"\")","v":""},{"$f":"IFERROR(INDEX(Admin!$M$34:$P$177,MATCH(Results!$B171,Admin!$S$34:$S$177,0),3),\"\")","v":""},{"$f":"IFERROR(INDEX(Admin!$M$34:$P$177,MATCH(Results!$B171,Admin!$S$34:$S$177,0),4),\"\")","v":""}]
[null,null,null,null,null,null,null,null,null,null,null,null,null,{"$f":"IFERROR(INDEX(Admin!$M$34:$P$177,MATCH(Results!$B172,Admin!$S$34:$S$177,0),1),\"\")","v":""},{"$f":"IFERROR(INDEX(Admin!$M$34:$P$177,MATCH(Results!$B172,Admin!$S$34:$S$177,0),3),\"\")","v":""},{"$f":"IFERROR(INDEX(Admin!$M$34:$P$177,MATCH(Results!$B172,Admin!$S$34:$S$177,0),4),\"\")","v":""}]
[null,null,null,null,null,null,null,null,null,null,null,null,null,{"$f":"IFERROR(INDEX(Admin!$M$34:$P$177,MATCH(Results!$B173,Admin!$S$34:$S$177,0),1),\"\")","v":""},{"$f":"IFERROR(INDEX(Admin!$M$34:$P$177,MATCH(Results!$B173,Admin!$S$34:$S$177,0),3),\"\")","v":""},{"$f":"IFERROR(INDEX(Admin!$M$34:$P$177,MATCH(Results!$B173,Admin!$S$34:$S$177,0),4),\"\")","v":""}]
[null,null,null,null,null,null,null,null,null,null,null,null,null,{"$f":"IFERROR(INDEX(Admin!$M$34:$P$177,MATCH(Results!$B174,Admin!$S$34:$S$177,0),1),\"\")","v":""},{"$f":"IFERROR(INDEX(Admin!$M$34:$P$177,MATCH(Results!$B174,Admin!$S$34:$S$177,0),3),\"\")","v":""},{"$f":"IFERROR(INDEX(Admin!$M$34:$P$177,MATCH(Results!$B174,Admin!$S$34:$S$177,0),4),\"\")","v":""}]
[null,null,null,null,null,null,null,null,null,null,null,null,null,{"$f":"IFERROR(INDEX(Admin!$M$34:$P$177,MATCH(Results!$B175,Admin!$S$34:$S$177,0),1),\"\")","v":""},{"$f":"IFERROR(INDEX(Admin!$M$34:$P$177,MATCH(Results!$B175,Admin!$S$34:$S$177,0),3),\"\")","v":""},{"$f":"IFERROR(INDEX(Admin!$M$34:$P$177,MATCH(Results!$B175,Admin!$S$34:$S$177,0),4),\"\")","v":""}]
[null,null,null,null,null,null,null,null,null,null,null,null,null,{"$f":"IFERROR(INDEX(Admin!$M$34:$P$177,MATCH(Results!$B176,Admin!$S$34:$S$177,0),1),\"\")","v":""},{"$f":"IFERROR(INDEX(Admin!$M$34:$P$177,MATCH(Results!$B176,Admin!$S$34:$S$177,0),3),\"\")","v":""},{"$f":"IFERROR(INDEX(Admin!$M$34:$P$177,MATCH(Results!$B176,Admin!$S$34:$S$177,0),4),\"\")","v":""}]
[null,null,null,null,null,null,null,null,null,null,null,null,null,{"$f":"IFERROR(INDEX(Admin!$M$34:$P$177,MATCH(Results!$B177,Admin!$S$34:$S$177,0),1),\"\")","v":""},{"$f":"IFERROR(INDEX(Admin!$M$34:$P$177,MATCH(Results!$B177,Admin!$S$34:$S$177,0),3),\"\")","v":""},{"$f":"IFERROR(INDEX(Admin!$M$34:$P$177,MATCH(Results!$B177,Admin!$S$34:$S$177,0),4),\"\")","v":""}]
[null,null,null,null,null,null,null,null,null,null,null,null,null,{"$f":"IFERROR(INDEX(Admin!$M$34:$P$177,MATCH(Results!$B178,Admin!$S$34:$S$177,0),1),\"\")","v":""},{"$f":"IFERROR(INDEX(Admin!$M$34:$P$177,MATCH(Results!$B178,Admin!$S$34:$S$177,0),3),\"\")","v":""},{"$f":"IFERROR(INDEX(Admin!$M$34:$P$177,MATCH(Results!$B178,Admin!$S$34:$S$177,0),4),\"\")","v":""}]
[null,null,null,null,null,null,null,null,null,null,null,null,null,{"$f":"IFERROR(INDEX(Admin!$M$34:$P$177,MATCH(Results!$B179,Admin!$S$34:$S$177,0),1),\"\")","v":""},{"$f":"IFERROR(INDEX(Admin!$M$34:$P$177,MATCH(Results!$B179,Admin!$S$34:$S$177,0),3),\"\")","v":""},{"$f":"IFERROR(INDEX(Admin!$M$34:$P$177,MATCH(Results!$B179,Admin!$S$34:$S$177,0),4),\"\")","v":""}]
[null,null,null,null,null,null,null,null,null,null,null,null,null,{"$f":"IFERROR(INDEX(Admin!$M$34:$P$177,MATCH(Results!$B180,Admin!$S$34:$S$177,0),1),\"\")","v":""},{"$f":"IFERROR(INDEX(Admin!$M$34:$P$177,MATCH(Results!$B180,Admin!$S$34:$S$177,0),3),\"\")","v":""},{"$f":"IFERROR(INDEX(Admin!$M$34:$P$177,MATCH(Results!$B180,Admin!$S$34:$S$177,0),4),\"\")","v":""}]
[null,null,null,null,null,null,null,null,null,null,null,null,null,{"$f":"IFERROR(INDEX(Admin!$M$34:$P$177,MATCH(Results!$B181,Admin!$S$34:$S$177,0),1),\"\")","v":""},{"$f":"IFERROR(INDEX(Admin!$M$34:$P$177,MATCH(Results!$B181,Admin!$S$34:$S$177,0),3),\"\")","v":""},{"$f":"IFERROR(INDEX(Admin!$M$34:$P$177,MATCH(Results!$B181,Admin!$S$34:$S$177,0),4),\"\")","v":""}]
[null,null,null,null,null,null,null,null,null,null,null,null,null,{"$f":"IFERROR(INDEX(Admin!$M$34:$P$177,MATCH(Results!$B182,Admin!$S$34:$S$177,0),1),\"\")","v":""},{"$f":"IFERROR(INDEX(Admin!$M$34:$P$177,MATCH(Results!$B182,Admin!$S$34:$S$177,0),3),\"\")","v":""},{"$f":"IFERROR(INDEX(Admin!$M$34:$P$177,MATCH(Results!$B182,Admin!$S$34:$S$177,0),4),\"\")","v":""}]
[null,null,null,null,null,null,null,null,null,null,null,null,null,{"$f":"IFERROR(INDEX(Admin!$M$34:$P$177,MATCH(Results!$B183,Admin!$S$34:$S$177,0),1),\"\")","v":""},{"$f":"IFERROR(INDEX(Admin!$M$34:$P$177,MATCH(Results!$B183,Admin!$S$34:$S$177,0),3),\"\")","v":""},{"$f":"IFERROR(INDEX(Admin!$M$34:$P$177,MATCH(Results!$B183,Admin!$S$34:$S$177,0),4),\"\")","v":""}]
[null,null,null,null,null,null,null,null,null,null,null,null,null,{"$f":"IFERROR(INDEX(Admin!$M$34:$P$177,MATCH(Results!$B184,Admin!$S$34:$S$177,0),1),\"\")","v":""},{"$f":"IFERROR(INDEX(Admin!$M$34:$P$177,MATCH(Results!$B184,Admin!$S$34:$S$177,0),3),\"\")","v":""},{"$f":"IFERROR(INDEX(Admin!$M$34:$P$177,MATCH(Results!$B184,Admin!$S$34:$S$177,0),4),\"\")","v":""}]
[null,null,null,null,null,null,null,null,null,null,null,null,null,{"$f":"IFERROR(INDEX(Admin!$M$34:$P$177,MATCH(Results!$B185,Admin!$S$34:$S$177,0),1),\"\")","v":""},{"$f":"IFERROR(INDEX(Admin!$M$34:$P$177,MATCH(Results!$B185,Admin!$S$34:$S$177,0),3),\"\")","v":""},{"$f":"IFERROR(INDEX(Admin!$M$34:$P$177,MATCH(Results!$B185,Admin!$S$34:$S$177,0),4),\"\")","v":""}]
[null,null,null,null,null,null,null,null,null,null,null,null,null,{"$f":"IFERROR(INDEX(Admin!$M$34:$P$177,MATCH(Results!$B186,Admin!$S$34:$S$177,0),1),\"\")","v":""},{"$f":"IFERROR(INDEX(Admin!$M$34:$P$177,MATCH(Results!$B186,Admin!$S$34:$S$177,0),3),\"\")","v":""},{"$f":"IFERROR(INDEX(Admin!$M$34:$P$177,MATCH(Results!$B186,Admin!$S$34:$S$177,0),4),\"\")","v":""}]
[null,null,null,null,null,null,null,null,null,null,null,null,null,{"$f":"IFERROR(INDEX(Admin!$M$34:$P$177,MATCH(Results!$B187,Admin!$S$34:$S$177,0),1),\"\")","v":""},{"$f":"IFERROR(INDEX(Admin!$M$34:$P$177,MATCH(Results!$B187,Admin!$S$34:$S$177,0),3),\"\")","v":""},{"$f":"IFERROR(INDEX(Admin!$M$34:$P$177,MATCH(Results!$B187,Admin!$S$34:$S$177,0),4),\"\")","v":""}]
[null,null,null,null,null,null,null,null,null,null,null,null,null,{"$f":"IFERROR(INDEX(Admin!$M$34:$P$177,MATCH(Results!$B188,Admin!$S$34:$S$177,0),1),\"\")","v":""},{"$f":"IFERROR(INDEX(Admin!$M$34:$P$177,MATCH(Results!$B188,Admin!$S$34:$S$177,0),3),\"\")","v":""},{"$f":"IFERROR(INDEX(Admin!$M$34:$P$177,MATCH(Results!$B188,Admin!$S$34:$S$177,0),4),\"\")","v":""}]
[null,null,null,null,null,null,null,null,null,null,null,null,null,{"$f":"IFERROR(INDEX(Admin!$M$34:$P$177,MATCH(Results!$B189,Admin!$S$34:$S$177,0),1),\"\")","v":""},{"$f":"IFERROR(INDEX(Admin!$M$34:$P$177,MATCH(Results!$B189,Admin!$S$34:$S$177,0),3),\"\")","v":""},{"$f":"IFERROR(INDEX(Admin!$M$34:$P$177,MATCH(Results!$B189,Admin!$S$34:$S$177,0),4),\"\")","v":""}]
[null,null,null,null,null,null,null,null,null,null,null,null,null,{"$f":"IFERROR(INDEX(Admin!$M$34:$P$177,MATCH(Results!$B190,Admin!$S$34:$S$177,0),1),\"\")","v":""},{"$f":"IFERROR(INDEX(Admin!$M$34:$P$177,MATCH(Results!$B190,Admin!$S$34:$S$177,0),3),\"\")","v":""},{"$f":"IFERROR(INDEX(Admin!$M$34:$P$177,MATCH(Results!$B190,Admin!$S$34:$S$177,0),4),\"\")","v":""}]
[null,null,null,null,null,null,null,null,null,null,null,null,null,{"$f":"IFERROR(INDEX(Admin!$M$34:$P$177,MATCH(Results!$B191,Admin!$S$34:$S$177,0),1),\"\")","v":""},{"$f":"IFERROR(INDEX(Admin!$M$34:$P$177,MATCH(Results!$B191,Admin!$S$34:$S$177,0),3),\"\")","v":""},{"$f":"IFERROR(INDEX(Admin!$M$34:$P$177,MATCH(Results!$B191,Admin!$S$34:$S$177,0),4),\"\")","v":""}]
[null,null,null,null,null,null,null,null,null,null,null,null,null,{"$f":"IFERROR(INDEX(Admin!$M$34:$P$177,MATCH(Results!$B192,Admin!$S$34:$S$177,0),1),\"\")","v":""},{"$f":"IFERROR(INDEX(Admin!$M$34:$P$177,MATCH(Results!$B192,Admin!$S$34:$S$177,0),3),\"\")","v":""},{"$f":"IFERROR(INDEX(Admin!$M$34:$P$177,MATCH(Results!$B192,Admin!$S$34:$S$177,0),4),\"\")","v":""}]
[null,null,null,null,null,null,null,null,null,null,null,null,null,{"$f":"IFERROR(INDEX(Admin!$M$34:$P$177,MATCH(Results!$B193,Admin!$S$34:$S$177,0),1),\"\")","v":""},{"$f":"IFERROR(INDEX(Admin!$M$34:$P$177,MATCH(Results!$B193,Admin!$S$34:$S$177,0),3),\"\")","v":""},{"$f":"IFERROR(INDEX(Admin!$M$34:$P$177,MATCH(Results!$B193,Admin!$S$34:$S$177,0),4),\"\")","v":""}]
[null,null,null,null,null,null,null,null,null,null,null,null,null,{"$f":"IFERROR(INDEX(Admin!$M$34:$P$177,MATCH(Results!$B194,Admin!$S$34:$S$177,0),1),\"\")","v":""},{"$f":"IFERROR(INDEX(Admin!$M$34:$P$177,MATCH(Results!$B194,Admin!$S$34:$S$177,0),3),\"\")","v":""},{"$f":"IFERROR(INDEX(Admin!$M$34:$P$177,MATCH(Results!$B194,Admin!$S$34:$S$177,0),4),\"\")","v":""}]
[null,null,null,null,null,null,null,null,null,null,null,null,null,{"$f":"IFERROR(INDEX(Admin!$M$34:$P$177,MATCH(Results!$B195,Admin!$S$34:$S$177,0),1),\"\")","v":""},{"$f":"IFERROR(INDEX(Admin!$M$34:$P$177,MATCH(Results!$B195,Admin!$S$34:$S$177,0),3),\"\")","v":""},{"$f":"IFERROR(INDEX(Admin!$M$34:$P$177,MATCH(Results!$B195,Admin!$S$34:$S$177,0),4),\"\")","v":""}]
[null,null,null,null,null,null,null,null,null,null,null,null,null,{"$f":"IFERROR(INDEX(Admin!$M$34:$P$177,MATCH(Results!$B196,Admin!$S$34:$S$177,0),1),\"\")","v":""},{"$f":"IFERROR(INDEX(Admin!$M$34:$P$177,MATCH(Results!$B196,Admin!$S$34:$S$177,0),3),\"\")","v":""},{"$f":"IFERROR(INDEX(Admin!$M$34:$P$177,MATCH(Results!$B196,Admin!$S$34:$S$177,0),4),\"\")","v":""}]
[null,null,null,null,null,null,null,null,null,null,null,null,null,{"$f":"IFERROR(INDEX(Admin!$M$34:$P$177,MATCH(Results!$B197,Admin!$S$34:$S$177,0),1),\"\")","v":""},{"$f":"IFERROR(INDEX(Admin!$M$34:$P$177,MATCH(Results!$B197,Admin!$S$34:$S$177,0),3),\"\")","v":""},{"$f":"IFERROR(INDEX(Admin!$M$34:$P$177,MATCH(Results!$B197,Admin!$S$34:$S$177,0),4),\"\")","v":""}]
[null,null,null,null,null,null,null,null,null,null,null,null,null,{"$f":"IFERROR(INDEX(Admin!$M$34:$P$177,MATCH(Results!$B198,Admin!$S$34:$S$177,0),1),\"\")","v":""},{"$f":"IFERROR(INDEX(Admin!$M$34:$P$177,MATCH(Results!$B198,Admin!$S$34:$S$177,0),3),\"\")","v":""},{"$f":"IFERROR(INDEX(Admin!$M$34:$P$177,MATCH(Results!$B198,Admin!$S$34:$S$177,0),4),\"\")","v":""}]
[null,null,null,null,null,null,null,null,null,null,null,null,null,{"$f":"IFERROR(INDEX(Admin!$M$34:$P$177,MATCH(Results!$B199,Admin!$S$34:$S$177,0),1),\"\")","v":""},{"$f":"IFERROR(INDEX(Admin!$M$34:$P$177,MATCH(Results!$B199,Admin!$S$34:$S$177,0),3),\"\")","v":""},{"$f":"IFERROR(INDEX(Admin!$M$34:$P$177,MATCH(Results!$B199,Admin!$S$34:$S$177,0),4),\"\")","v":""}]
[null,null,null,null,null,null,null,null,null,null,null,null,null,{"$f":"IFERROR(INDEX(Admin!$M$34:$P$177,MATCH(Results!$B200,Admin!$S$34:$S$177,0),1),\"\")","v":""},{"$f":"IFERROR(INDEX(Admin!$M$34:$P$177,MATCH(Results!$B200,Admin!$S$34:$S$177,0),3),\"\")","v":""},{"$f":"IFERROR(INDEX(Admin!$M$34:$P$177,MATCH(Results!$B200,Admin!$S$34:$S$177,0),4),\"\")","v":""}]
[null,null,null,null,null,null,null,null,null,null,null,null,null,{"$f":"IFERROR(INDEX(Admin!$M$34:$P$177,MATCH(Results!$B201,Admin!$S$34:$S$177,0),1),\"\")","v":""},{"$f":"IFERROR(INDEX(Admin!$M$34:$P$177,MATCH(Results!$B201,Admin!$S$34:$S$177,0),3),\"\")","v":""},{"$f":"IFERROR(INDEX(Admin!$M$34:$P$177,MATCH(Results!$B201,Admin!$S$34:$S$177,0),4),\"\")","v":""}]
[null,null,null,null,null,null,null,null,null,null,null,null,null,{"$f":"IFERROR(INDEX(Admin!$M$34:$P$177,MATCH(Results!$B202,Admin!$S$34:$S$177,0),1),\"\")","v":""},{"$f":"IFERROR(INDEX(Admin!$M$34:$P$177,MATCH(Results!$B202,Admin!$S$34:$S$177,0),3),\"\")","v":""},{"$f":"IFERROR(INDEX(Admin!$M$34:$P$177,MATCH(Results!$B202,Admin!$S$34:$S$177,0),4),\"\")","v":""}]
[null,null,null,null,null,null,null,null,null,null,null,null,null,{"$f":"IFERROR(INDEX(Admin!$M$34:$P$177,MATCH(Results!$B203,Admin!$S$34:$S$177,0),1),\"\")","v":""},{"$f":"IFERROR(INDEX(Admin!$M$34:$P$177,MATCH(Results!$B203,Admin!$S$34:$S$177,0),3),\"\")","v":""},{"$f":"IFERROR(INDEX(Admin!$M$34:$P$177,MATCH(Results!$B203,Admin!$S$34:$S$177,0),4),\"\")","v":""}]
[null,null,null,null,null,null,null,null,null,null,null,null,null,{"$f":"IFERROR(INDEX(Admin!$M$34:$P$177,MATCH(Results!$B204,Admin!$S$34:$S$177,0),1),\"\")","v":""},{"$f":"IFERROR(INDEX(Admin!$M$34:$P$177,MATCH(Results!$B204,Admin!$S$34:$S$177,0),3),\"\")","v":""},{"$f":"IFERROR(INDEX(Admin!$M$34:$P$177,MATCH(Results!$B204,Admin!$S$34:$S$177,0),4),\"\")","v":""}]
[null,null,null,null,null,null,null,null,null,null,null,null,null,{"$f":"IFERROR(INDEX(Admin!$M$34:$P$177,MATCH(Results!$B205,Admin!$S$34:$S$177,0),1),\"\")","v":""},{"$f":"IFERROR(INDEX(Admin!$M$34:$P$177,MATCH(Results!$B205,Admin!$S$34:$S$177,0),3),\"\")","v":""},{"$f":"IFERROR(INDEX(Admin!$M$34:$P$177,MATCH(Results!$B205,Admin!$S$34:$S$177,0),4),\"\")","v":""}]
[null,null,null,null,null,null,null,null,null,null,null,null,null,{"$f":"IFERROR(INDEX(Admin!$M$34:$P$177,MATCH(Results!$B206,Admin!$S$34:$S$177,0),1),\"\")","v":""},{"$f":"IFERROR(INDEX(Admin!$M$34:$P$177,MATCH(Results!$B206,Admin!$S$34:$S$177,0),3),\"\")","v":""},{"$f":"IFERROR(INDEX(Admin!$M$34:$P$177,MATCH(Results!$B206,Admin!$S$34:$S$177,0),4),\"\")","v":""}]
[null,null,null,null,null,null,null,null,null,null,null,null,null,{"$f":"IFERROR(INDEX(Admin!$M$34:$P$177,MATCH(Results!$B207,Admin!$S$34:$S$177,0),1),\"\")","v":""},{"$f":"IFERROR(INDEX(Admin!$M$34:$P$177,MATCH(Results!$B207,Admin!$S$34:$S$177,0),3),\"\")","v":""},{"$f":"IFERROR(INDEX(Admin!$M$34:$P$177,MATCH(Results!$B207,Admin!$S$34:$S$177,0),4),\"\")","v":""}]
[null,null,null,null,null,null,null,null,null,null,null,null,null,{"$f":"IFERROR(INDEX(Admin!$M$34:$P$177,MATCH(Results!$B208,Admin!$S$34:$S$177,0),1),\"\")","v":""},{"$f":"IFERROR(INDEX(Admin!$M$34:$P$177,MATCH(Results!$B208,Admin!$S$34:$S$177,0),3),\"\")","v":""},{"$f":"IFERROR(INDEX(Admin!$M$34:$P$177,MATCH(Results!$B208,Admin!$S$34:$S$177,0),4),\"\")","v":""}]
[null,null,null,null,null,null,null,null,null,null,null,null,null,{"$f":"IFERROR(INDEX(Admin!$M$34:$P$177,MATCH(Results!$B209,Admin!$S$34:$S$177,0),1),\"\")","v":""},{"$f":"IFERROR(INDEX(Admin!$M$34:$P$177,MATCH(Results!$B209,Admin!$S$34:$S$177,0),3),\"\")","v":""},{"$f":"IFERROR(INDEX(Admin!$M$34:$P$177,MATCH(Results!$B209,Admin!$S$34:$S$177,0),4),\"\")","v":""}]
[null,null,null,null,null,null,null,null,null,null,null,null,null,{"$f":"IFERROR(INDEX(Admin!$M$34:$P$177,MATCH(Results!$B210,Admin!$S$34:$S$177,0),1),\"\")","v":""},{"$f":"IFERROR(INDEX(Admin!$M$34:$P$177,MATCH(Results!$B210,Admin!$S$34:$S$177,0),3),\"\")","v":""},{"$f":"IFERROR(INDEX(Admin!$M$34:$P$177,MATCH(Results!$B210,Admin!$S$34:$S$177,0),4),\"\")","v":""}]
[null,null,null,null,null,null,null,null,null,null,null,null,null,{"$f":"IFERROR(INDEX(Admin!$M$34:$P$177,MATCH(Results!$B211,Admin!$S$34:$S$177,0),1),\"\")","v":""},{"$f":"IFERROR(INDEX(Admin!$M$34:$P$177,MATCH(Results!$B211,Admin!$S$34:$S$177,0),3),\"\")","v":""},{"$f":"IFERROR(INDEX(Admin!$M$34:$P$177,MATCH(Results!$B211,Admin!$S$34:$S$177,0),4),\"\")","v":""}]
[null,null,null,null,null,null,null,null,null,null,null,null,null,{"$f":"IFERROR(INDEX(Admin!$M$34:$P$177,MATCH(Results!$B212,Admin!$S$34:$S$177,0),1),\"\")","v":""},{"$f":"IFERROR(INDEX(Admin!$M$34:$P$177,MATCH(Results!$B212,Admin!$S$34:$S$177,0),3),\"\")","v":""},{"$f":"IFERROR(INDEX(Admin!$M$34:$P$177,MATCH(Results!$B212,Admin!$S$34:$S$177,0),4),\"\")","v":""}]
[null,null,null,null,null,null,null,null,null,null,null,null,null,{"$f":"IFERROR(INDEX(Admin!$M$34:$P$177,MATCH(Results!$B213,Admin!$S$34:$S$177,0),1),\"\")","v":""},{"$f":"IFERROR(INDEX(Admin!$M$34:$P$177,MATCH(Results!$B213,Admin!$S$34:$S$177,0),3),\"\")","v":""},{"$f":"IFERROR(INDEX(Admin!$M$34:$P$177,MATCH(Results!$B213,Admin!$S$34:$S$177,0),4),\"\")","v":""}]
[null,null,null,null,null,null,null,null,null,null,null,null,null,{"$f":"IFERROR(INDEX(Admin!$M$34:$P$177,MATCH(Results!$B214,Admin!$S$34:$S$177,0),1),\"\")","v":""},{"$f":"IFERROR(INDEX(Admin!$M$34:$P$177,MATCH(Results!$B214,Admin!$S$34:$S$177,0),3),\"\")","v":""},{"$f":"IFERROR(INDEX(Admin!$M$34:$P$177,MATCH(Results!$B214,Admin!$S$34:$S$177,0),4),\"\")","v":""}]
[null,null,null,null,null,null,null,null,null,null,null,null,null,{"$f":"IFERROR(INDEX(Admin!$M$34:$P$177,MATCH(Results!$B215,Admin!$S$34:$S$177,0),1),\"\")","v":""},{"$f":"IFERROR(INDEX(Admin!$M$34:$P$177,MATCH(Results!$B215,Admin!$S$34:$S$177,0),3),\"\")","v":""},{"$f":"IFERROR(INDEX(Admin!$M$34:$P$177,MATCH(Results!$B215,Admin!$S$34:$S$177,0),4),\"\")","v":""}]
[null,null,null,null,null,null,null,null,null,null,null,null,null,{"$f":"IFERROR(INDEX(Admin!$M$34:$P$177,MATCH(Results!$B216,Admin!$S$34:$S$177,0),1),\"\")","v":""},{"$f":"IFERROR(INDEX(Admin!$M$34:$P$177,MATCH(Results!$B216,Admin!$S$34:$S$177,0),3),\"\")","v":""},{"$f":"IFERROR(INDEX(Admin!$M$34:$P$177,MATCH(Results!$B216,Admin!$S$34:$S$177,0),4),\"\")","v":""}]
[null,null,null,null,null,null,null,null,null,null,null,null,null,{"$f":"IFERROR(INDEX(Admin!$M$34:$P$177,MATCH(Results!$B217,Admin!$S$34:$S$177,0),1),\"\")","v":""},{"$f":"IFERROR(INDEX(Admin!$M$34:$P$177,MATCH(Results!$B217,Admin!$S$34:$S$177,0),3),\"\")","v":""},{"$f":"IFERROR(INDEX(Admin!$M$34:$P$177,MATCH(Results!$B217,Admin!$S$34:$S$177,0),4),\"\")","v":""}]
[null,null,null,null,null,null,null,null,null,null,null,null,null,{"$f":"IFERROR(INDEX(Admin!$M$34:$P$177,MATCH(Results!$B218,Admin!$S$34:$S$177,0),1),\"\")","v":""},{"$f":"IFERROR(INDEX(Admin!$M$34:$P$177,MATCH(Results!$B218,Admin!$S$34:$S$177,0),3),\"\")","v":""},{"$f":"IFERROR(INDEX(Admin!$M$34:$P$177,MATCH(Results!$B218,Admin!$S$34:$S$177,0),4),\"\")","v":""}]
[null,null,null,null,null,null,null,null,null,null,null,null,null,{"$f":"IFERROR(INDEX(Admin!$M$34:$P$177,MATCH(Results!$B219,Admin!$S$34:$S$177,0),1),\"\")","v":""},{"$f":"IFERROR(INDEX(Admin!$M$34:$P$177,MATCH(Results!$B219,Admin!$S$34:$S$177,0),3),\"\")","v":""},{"$f":"IFERROR(INDEX(Admin!$M$34:$P$177,MATCH(Results!$B219,Admin!$S$34:$S$177,0),4),\"\")","v":""}]
[null,null,null,null,null,null,null,null,null,null,null,null,null,{"$f":"IFERROR(INDEX(Admin!$M$34:$P$177,MATCH(Results!$B220,Admin!$S$34:$S$177,0),1),\"\")","v":""},{"$f":"IFERROR(INDEX(Admin!$M$34:$P$177,MATCH(Results!$B220,Admin!$S$34:$S$177,0),3),\"\")","v":""},{"$f":"IFERROR(INDEX(Admin!$M$34:$P$177,MATCH(Results!$B220,Admin!$S$34:$S$177,0),4),\"\")","v":""}]
[null,null,null,null,null,null,null,null,null,null,null,null,null,{"$f":"IFERROR(INDEX(Admin!$M$34:$P$177,MATCH(Results!$B221,Admin!$S$34:$S$177,0),1),\"\")","v":""},{"$f":"IFERROR(INDEX(Admin!$M$34:$P$177,MATCH(Results!$B221,Admin!$S$34:$S$177,0),3),\"\")","v":""},{"$f":"IFERROR(INDEX(Admin!$M$34:$P$177,MATCH(Results!$B221,Admin!$S$34:$S$177,0),4),\"\")","v":""}]
[null,null,null,null,null,null,null,null,null,null,null,null,null,{"$f":"IFERROR(INDEX(Admin!$M$34:$P$177,MATCH(Results!$B222,Admin!$S$34:$S$177,0),1),\"\")","v":""},{"$f":"IFERROR(INDEX(Admin!$M$34:$P$177,MATCH(Results!$B222,Admin!$S$34:$S$177,0),3),\"\")","v":""},{"$f":"IFERROR(INDEX(Admin!$M$34:$P$177,MATCH(Results!$B222,Admin!$S$34:$S$177,0),4),\"\")","v":""}]
[null,null,null,null,null,null,null,null,null,null,null,null,null,{"$f":"IFERROR(INDEX(Admin!$M$34:$P$177,MATCH(Results!$B223,Admin!$S$34:$S$177,0),1),\"\")","v":""},{"$f":"IFERROR(INDEX(Admin!$M$34:$P$177,MATCH(Results!$B223,Admin!$S$34:$S$177,0),3),\"\")","v":""},{"$f":"IFERROR(INDEX(Admin!$M$34:$P$177,MATCH(Results!$B223,Admin!$S$34:$S$177,0),4),\"\")","v":""}]
[null,null,null,null,null,null,null,null,null,null,null,null,null,{"$f":"IFERROR(INDEX(Admin!$M$34:$P$177,MATCH(Results!$B224,Admin!$S$34:$S$177,0),1),\"\")","v":""},{"$f":"IFERROR(INDEX(Admin!$M$34:$P$177,MATCH(Results!$B224,Admin!$S$34:$S$177,0),3),\"\")","v":""},{"$f":"IFERROR(INDEX(Admin!$M$34:$P$177,MATCH(Results!$B224,Admin!$S$34:$S$177,0),4),\"\")","v":""}]
[null,null,null,null,null,null,null,null,null,null,null,null,null,{"$f":"IFERROR(INDEX(Admin!$M$34:$P$177,MATCH(Results!$B225,Admin!$S$34:$S$177,0),1),\"\")","v":""},{"$f":"IFERROR(INDEX(Admin!$M$34:$P$177,MATCH(Results!$B225,Admin!$S$34:$S$177,0),3),\"\")","v":""},{"$f":"IFERROR(INDEX(Admin!$M$34:$P$177,MATCH(Results!$B225,Admin!$S$34:$S$177,0),4),\"\")","v":""}]
[null,null,null,null,null,null,null,null,null,null,null,null,null,{"$f":"IFERROR(INDEX(Admin!$M$34:$P$177,MATCH(Results!$B226,Admin!$S$34:$S$177,0),1),\"\")","v":""},{"$f":"IFERROR(INDEX(Admin!$M$34:$P$177,MATCH(Results!$B226,Admin!$S$34:$S$177,0),3),\"\")","v":""},{"$f":"IFERROR(INDEX(Admin!$M$34:$P$177,MATCH(Results!$B226,Admin!$S$34:$S$177,0),4),\"\")","v":""}]
[null,null,null,null,null,null,null,null,null,null,null,null,null,{"$f":"IFERROR(INDEX(Admin!$M$34:$P$177,MATCH(Results!$B227,Admin!$S$34:$S$177,0),1),\"\")","v":""},{"$f":"IFERROR(INDEX(Admin!$M$34:$P$177,MATCH(Results!$B227,Admin!$S$34:$S$177,0),3),\"\")","v":""},{"$f":"IFERROR(INDEX(Admin!$M$34:$P$177,MATCH(Results!$B227,Admin!$S$34:$S$177,0),4),\"\")","v":""}]
[null,null,null,null,null,null,null,null,null,null,null,null,null,{"$f":"IFERROR(INDEX(Admin!$M$34:$P$177,MATCH(Results!$B228,Admin!$S$34:$S$177,0),1),\"\")","v":""},{"$f":"IFERROR(INDEX(Admin!$M$34:$P$177,MATCH(Results!$B228,Admin!$S$34:$S$177,0),3),\"\")","v":""},{"$f":"IFERROR(INDEX(Admin!$M$34:$P$177,MATCH(Results!$B228,Admin!$S$34:$S$177,0),4),\"\")","v":""}]
[null,null,null,null,null,null,null,null,null,null,null,null,null,{"$f":"IFERROR(INDEX(Admin!$M$34:$P$177,MATCH(Results!$B229,Admin!$S$34:$S$177,0),1),\"\")","v":""},{"$f":"IFERROR(INDEX(Admin!$M$34:$P$177,MATCH(Results!$B229,Admin!$S$34:$S$177,0),3),\"\")","v":""},{"$f":"IFERROR(INDEX(Admin!$M$34:$P$177,MATCH(Results!$B229,Admin!$S$34:$S$177,0),4),\"\")","v":""}]
[null,null,null,null,null,null,null,null,null,null,null,null,null,{"$f":"IFERROR(INDEX(Admin!$M$34:$P$177,MATCH(Results!$B230,Admin!$S$34:$S$177,0),1),\"\")","v":""},{"$f":"IFERROR(INDEX(Admin!$M$34:$P$177,MATCH(Results!$B230,Admin!$S$34:$S$177,0),3),\"\")","v":""},{"$f":"IFERROR(INDEX(Admin!$M$34:$P$177,MATCH(Results!$B230,Admin!$S$34:$S$177,0),4),\"\")","v":""}]
[null,null,null,null,null,null,null,null,null,null,null,null,null,{"$f":"IFERROR(INDEX(Admin!$M$34:$P$177,MATCH(Results!$B231,Admin!$S$34:$S$177,0),1),\"\")","v":""},{"$f":"IFERROR(INDEX(Admin!$M$34:$P$177,MATCH(Results!$B231,Admin!$S$34:$S$177,0),3),\"\")","v":""},{"$f":"IFERROR(INDEX(Admin!$M$34:$P$177,MATCH(Results!$B231,Admin!$S$34:$S$177,0),4),\"\")","v":""}]
[null,null,null,null,null,null,null,null,null,null,null,null,null,{"$f":"IFERROR(INDEX(Admin!$M$34:$P$177,MATCH(Results!$B232,Admin!$S$34:$S$177,0),1),\"\")","v":""},{"$f":"IFERROR(INDEX(Admin!$M$34:$P$177,MATCH(Results!$B232,Admin!$S$34:$S$177,0),3),\"\")","v":""},{"$f":"IFERROR(INDEX(Admin!$M$34:$P$177,MATCH(Results!$B232,Admin!$S$34:$S$177,0),4),\"\")","v":""}]
[null,null,null,null,null,null,null,null,null,null,null,null,null,{"$f":"IFERROR(INDEX(Admin!$M$34:$P$177,MATCH(Results!$B233,Admin!$S$34:$S$177,0),1),\"\")","v":""},{"$f":"IFERROR(INDEX(Admin!$M$34:$P$177,MATCH(Results!$B233,Admin!$S$34:$S$177,0),3),\"\")","v":""},{"$f":"IFERROR(INDEX(Admin!$M$34:$P$177,MATCH(Results!$B233,Admin!$S$34:$S$177,0),4),\"\")","v":""}]
[null,null,null,null,null,null,null,null,null,null,null,null,null,{"$f":"IFERROR(INDEX(Admin!$M$34:$P$177,MATCH(Results!$B234,Admin!$S$34:$S$177,0),1),\"\")","v":""},{"$f":"IFERROR(INDEX(Admin!$M$34:$P$177,MATCH(Results!$B234,Admin!$S$34:$S$177,0),3),\"\")","v":""},{"$f":"IFERROR(INDEX(Admin!$M$34:$P$177,MATCH(Results!$B234,Admin!$S$34:$S$177,0),4),\"\")","v":""}]
[null,null,null,null,null,null,null,null,null,null,null,null,null,{"$f":"IFERROR(INDEX(Admin!$M$34:$P$177,MATCH(Results!$B235,Admin!$S$34:$S$177,0),1),\"\")","v":""},{"$f":"IFERROR(INDEX(Admin!$M$34:$P$177,MATCH(Results!$B235,Admin!$S$34:$S$177,0),3),\"\")","v":""},{"$f":"IFERROR(INDEX(Admin!$M$34:$P$177,MATCH(Results!$B235,Admin!$S$34:$S$177,0),4),\"\")","v":""}]
[null,null,null,null,null,null,null,null,null,null,null,null,null,{"$f":"IFERROR(INDEX(Admin!$M$34:$P$177,MATCH(Results!$B236,Admin!$S$34:$S$177,0),1),\"\")","v":""},{"$f":"IFERROR(INDEX(Admin!$M$34:$P$177,MATCH(Results!$B236,Admin!$S$34:$S$177,0),3),\"\")","v":""},{"$f":"IFERROR(INDEX(Admin!$M$34:$P$177,MATCH(Results!$B236,Admin!$S$34:$S$177,0),4),\"\")","v":""}]
[null,null,null,null,null,null,null,null,null,null,null,null,null,{"$f":"IFERROR(INDEX(Admin!$M$34:$P$177,MATCH(Results!$B237,Admin!$S$34:$S$177,0),1),\"\")","v":""},{"$f":"IFERROR(INDEX(Admin!$M$34:$P$177,MATCH(Results!$B237,Admin!$S$34:$S$177,0),3),\"\")","v":""},{"$f":"IFERROR(INDEX(Admin!$M$34:$P$177,MATCH(Results!$B237,Admin!$S$34:$S$177,0),4),\"\")","v":""}]
[null,null,null,null,null,null,null,null,null,null,null,null,null,{"$f":"IFERROR(INDEX(Admin!$M$34:$P$177,MATCH(Results!$B238,Admin!$S$34:$S$177,0),1),\"\")","v":""},{"$f":"IFERROR(INDEX(Admin!$M$34:$P$177,MATCH(Results!$B238,Admin!$S$34:$S$177,0),3),\"\")","v":""},{"$f":"IFERROR(INDEX(Admin!$M$34:$P$177,MATCH(Results!$B238,Admin!$S$34:$S$177,0),4),\"\")","v":""}]
[null,null,null,null,null,null,null,null,null,null,null,null,null,{"$f":"IFERROR(INDEX(Admin!$M$34:$P$177,MATCH(Results!$B239,Admin!$S$34:$S$177,0),1),\"\")","v":""},{"$f":"IFERROR(INDEX(Admin!$M$34:$P$177,MATCH(Results!$B239,Admin!$S$34:$S$177,0),3),\"\")","v":""},{"$f":"IFERROR(INDEX(Admin!$M$34:$P$177,MATCH(Results!$B239,Admin!$S$34:$S$177,0),4),\"\")","v":""}]
[null,null,null,null,null,null,null,null,null,null,null,null,null,{"$f":"IFERROR(INDEX(Admin!$M$34:$P$177,MATCH(Results!$B240,Admin!$S$34:$S$177,0),1),\"\")","v":""},{"$f":"IFERROR(INDEX(Admin!$M$34:$P$177,MATCH(Results!$B240,Admin!$S$34:$S$177,0),3),\"\")","v":""},{"$f":"IFERROR(INDEX(Admin!$M$34:$P$177,MATCH(Results!$B240,Admin!$S$34:$S$177,0),4),\"\")","v":""}]
[null,null,null,null,null,null,null,null,null,null,null,null,null,{"$f":"IFERROR(INDEX(Admin!$M$34:$P$177,MATCH(Results!$B241,Admin!$S$34:$S$177,0),1),\"\")","v":""},{"$f":"IFERROR(INDEX(Admin!$M$34:$P$177,MATCH(Results!$B241,Admin!$S$34:$S$177,0),3),\"\")","v":""},{"$f":"IFERROR(INDEX(Admin!$M$34:$P$177,MATCH(Results!$B241,Admin!$S$34:$S$177,0),4),\"\")","v":""}]
[null,null,null,null,null,null,null,null,null,null,null,null,null,{"$f":"IFERROR(INDEX(Admin!$M$34:$P$177,MATCH(Results!$B242,Admin!$S$34:$S$177,0),1),\"\")","v":""},{"$f":"IFERROR(INDEX(Admin!$M$34:$P$177,MATCH(Results!$B242,Admin!$S$34:$S$177,0),3),\"\")","v":""},{"$f":"IFERROR(INDEX(Admin!$M$34:$P$177,MATCH(Results!$B242,Admin!$S$34:$S$177,0),4),\"\")","v":""}]
[null,null,null,null,null,null,null,null,null,null,null,null,null,{"$f":"IFERROR(INDEX(Admin!$M$34:$P$177,MATCH(Results!$B243,Admin!$S$34:$S$177,0),1),\"\")","v":""},{"$f":"IFERROR(INDEX(Admin!$M$34:$P$177,MATCH(Results!$B243,Admin!$S$34:$S$177,0),3),\"\")","v":""},{"$f":"IFERROR(INDEX(Admin!$M$34:$P$177,MATCH(Results!$B243,Admin!$S$34:$S$177,0),4),\"\")","v":""}]
[null,null,null,null,null,null,null,null,null,null,null,null,null,{"$f":"IFERROR(INDEX(Admin!$M$34:$P$177,MATCH(Results!$B244,Admin!$S$34:$S$177,0),1),\"\")","v":""},{"$f":"IFERROR(INDEX(Admin!$M$34:$P$177,MATCH(Results!$B244,Admin!$S$34:$S$177,0),3),\"\")","v":""},{"$f":"IFERROR(INDEX(Admin!$M$34:$P$177,MATCH(Results!$B244,Admin!$S$34:$S$177,0),4),\"\")","v":""}]
[null,null,null,null,null,null,null,null,null,null,null,null,null,{"$f":"IFERROR(INDEX(Admin!$M$34:$P$177,MATCH(Results!$B245,Admin!$S$34:$S$177,0),1),\"\")","v":""},{"$f":"IFERROR(INDEX(Admin!$M$34:$P$177,MATCH(Results!$B245,Admin!$S$34:$S$177,0),3),\"\")","v":""},{"$f":"IFERROR(INDEX(Admin!$M$34:$P$177,MATCH(Results!$B245,Admin!$S$34:$S$177,0),4),\"\")","v":""}]
[null,null,null,null,null,null,null,null,null,null,null,null,null,{"$f":"IFERROR(INDEX(Admin!$M$34:$P$177,MATCH(Results!$B246,Admin!$S$34:$S$177,0),1),\"\")","v":""},{"$f":"IFERROR(INDEX(Admin!$M$34:$P$177,MATCH(Results!$B246,Admin!$S$34:$S$177,0),3),\"\")","v":""},{"$f":"IFERROR(INDEX(Admin!$M$34:$P$177,MATCH(Results!$B246,Admin!$S$34:$S$177,0),4),\"\")","v":""}]
[null,null,null,null,null,null,null,null,null,null,null,null,null,{"$f":"IFERROR(INDEX(Admin!$M$34:$P$177,MATCH(Results!$B247,Admin!$S$34:$S$177,0),1),\"\")","v":""},{"$f":"IFERROR(INDEX(Admin!$M$34:$P$177,MATCH(Results!$B247,Admin!$S$34:$S$177,0),3),\"\")","v":""},{"$f":"IFERROR(INDEX(Admin!$M$34:$P$177,MATCH(Results!$B247,Admin!$S$34:$S$177,0),4),\"\")","v":""}]
[null,null,null,null,null,null,null,null,null,null,null,null,null,{"$f":"IFERROR(INDEX(Admin!$M$34:$P$177,MATCH(Results!$B248,Admin!$S$34:$S$177,0),1),\"\")","v":""},{"$f":"IFERROR(INDEX(Admin!$M$34:$P$177,MATCH(Results!$B248,Admin!$S$34:$S$177,0),3),\"\")","v":""},{"$f":"IFERROR(INDEX(Admin!$M$34:$P$177,MATCH(Results!$B248,Admin!$S$34:$S$177,0),4),\"\")","v":""}]
[null,null,null,null,null,null,null,null,null,null,null,null,null,{"$f":"IFERROR(INDEX(Admin!$M$34:$P$177,MATCH(Results!$B249,Admin!$S$34:$S$177,0),1),\"\")","v":""},{"$f":"IFERROR(INDEX(Admin!$M$34:$P$177,MATCH(Results!$B249,Admin!$S$34:$S$177,0),3),\"\")","v":""},{"$f":"IFERROR(INDEX(Admin!$M$34:$P$177,MATCH(Results!$B249,Admin!$S$34:$S$177,0),4),\"\")","v":""}]
[null,null,null,null,null,null,null,null,null,null,null,null,null,{"$f":"IFERROR(INDEX(Admin!$M$34:$P$177,MATCH(Results!$B250,Admin!$S$34:$S$177,0),1),\"\")","v":""},{"$f":"IFERROR(INDEX(Admin!$M$34:$P$177,MATCH(Results!$B250,Admin!$S$34:$S$177,0),3),\"\")","v":""},{"$f":"IFERROR(INDEX(Admin!$M$34:$P$177,MATCH(Results!$B250,Admin!$S$34:$S$177,0),4),\"\")","v":""}]
[null,null,null,null,null,null,null,null,null,null,null,null,null,{"$f":"IFERROR(INDEX(Admin!$M$34:$P$177,MATCH(Results!$B251,Admin!$S$34:$S$177,0),1),\"\")","v":""},{"$f":"IFERROR(INDEX(Admin!$M$34:$P$177,MATCH(Results!$B251,Admin!$S$34:$S$177,0),3),\"\")","v":""},{"$f":"IFERROR(INDEX(Admin!$M$34:$P$177,MATCH(Results!$B251,Admin!$S$34:$S$177,0),4),\"\")","v":""}]
[null,null,null,null,null,null,null,null,null,null,null,null,null,{"$f":"IFERROR(INDEX(Admin!$M$34:$P$177,MATCH(Results!$B252,Admin!$S$34:$S$177,0),1),\"\")","v":""},{"$f":"IFERROR(INDEX(Admin!$M$34:$P$177,MATCH(Results!$B252,Admin!$S$34:$S$177,0),3),\"\")","v":""},{"$f":"IFERROR(INDEX(Admin!$M$34:$P$177,MATCH(Results!$B252,Admin!$S$34:$S$177,0),4),\"\")","v":""}]
[null,null,null,null,null,null,null,null,null,null,null,null,null,{"$f":"IFERROR(INDEX(Admin!$M$34:$P$177,MATCH(Results!$B253,Admin!$S$34:$S$177,0),1),\"\")","v":""},{"$f":"IFERROR(INDEX(Admin!$M$34:$P$177,MATCH(Results!$B253,Admin!$S$34:$S$177,0),3),\"\")","v":""},{"$f":"IFERROR(INDEX(Admin!$M$34:$P$177,MATCH(Results!$B253,Admin!$S$34:$S$177,0),4),\"\")","v":""}]
[null,null,null,null,null,null,null,null,null,null,null,null,null,{"$f":"IFERROR(INDEX(Admin!$M$34:$P$177,MATCH(Results!$B254,Admin!$S$34:$S$177,0),1),\"\")","v":""},{"$f":"IFERROR(INDEX(Admin!$M$34:$P$177,MATCH(Results!$B254,Admin!$S$34:$S$177,0),3),\"\")","v":""},{"$f":"IFERROR(INDEX(Admin!$M$34:$P$177,MATCH(Results!$B254,Admin!$S$34:$S$177,0),4),\"\")","v":""}]
[null,null,null,null,null,null,null,null,null,null,null,null,null,{"$f":"IFERROR(INDEX(Admin!$M$34:$P$177,MATCH(Results!$B255,Admin!$S$34:$S$177,0),1),\"\")","v":""},{"$f":"IFERROR(INDEX(Admin!$M$34:$P$177,MATCH(Results!$B255,Admin!$S$34:$S$177,0),3),\"\")","v":""},{"$f":"IFERROR(INDEX(Admin!$M$34:$P$177,MATCH(Results!$B255,Admin!$S$34:$S$177,0),4),\"\")","v":""}]
[null,null,null,null,null,null,null,null,null,null,null,null,null,{"$f":"IFERROR(INDEX(Admin!$M$34:$P$177,MATCH(Results!$B256,Admin!$S$34:$S$177,0),1),\"\")","v":""},{"$f":"IFERROR(INDEX(Admin!$M$34:$P$177,MATCH(Results!$B256,Admin!$S$34:$S$177,0),3),\"\")","v":""},{"$f":"IFERROR(INDEX(Admin!$M$34:$P$177,MATCH(Results!$B256,Admin!$S$34:$S$177,0),4),\"\")","v":""}]
[null,null,null,null,null,null,null,null,null,null,null,null,null,{"$f":"IFERROR(INDEX(Admin!$M$34:$P$177,MATCH(Results!$B257,Admin!$S$34:$S$177,0),1),\"\")","v":""},{"$f":"IFERROR(INDEX(Admin!$M$34:$P$177,MATCH(Results!$B257,Admin!$S$34:$S$177,0),3),\"\")","v":""},{"$f":"IFERROR(INDEX(Admin!$M$34:$P$177,MATCH(Results!$B257,Admin!$S$34:$S$177,0),4),\"\")","v":""}]
[null,null,null,null,null,null,null,null,null,null,null,null,null,{"$f":"IFERROR(INDEX(Admin!$M$34:$P$177,MATCH(Results!$B258,Admin!$S$34:$S$177,0),1),\"\")","v":""},{"$f":"IFERROR(INDEX(Admin!$M$34:$P$177,MATCH(Results!$B258,Admin!$S$34:$S$177,0),3),\"\")","v":""},{"$f":"IFERROR(INDEX(Admin!$M$34:$P$177,MATCH(Results!$B258,Admin!$S$34:$S$177,0),4),\"\")","v":""}]
[null,null,null,null,null,null,null,null,null,null,null,null,null,{"$f":"IFERROR(INDEX(Admin!$M$34:$P$177,MATCH(Results!$B259,Admin!$S$34:$S$177,0),1),\"\")","v":""},{"$f":"IFERROR(INDEX(Admin!$M$34:$P$177,MATCH(Results!$B259,Admin!$S$34:$S$177,0),3),\"\")","v":""},{"$f":"IFERROR(INDEX(Admin!$M$34:$P$177,MATCH(Results!$B259,Admin!$S$34:$S$177,0),4),\"\")","v":""}]
[null,null,null,null,null,null,null,null,null,null,null,null,null,{"$f":"IFERROR(INDEX(Admin!$M$34:$P$177,MATCH(Results!$B260,Admin!$S$34:$S$177,0),1),\"\")","v":""},{"$f":"IFERROR(INDEX(Admin!$M$34:$P$177,MATCH(Results!$B260,Admin!$S$34:$S$177,0),3),\"\")","v":""},{"$f":"IFERROR(INDEX(Admin!$M$34:$P$177,MATCH(Results!$B260,Admin!$S$34:$S$177,0),4),\"\")","v":""}]
[null,null,null,null,null,null,null,null,null,null,null,null,null,{"$f":"IFERROR(INDEX(Admin!$M$34:$P$177,MATCH(Results!$B261,Admin!$S$34:$S$177,0),1),\"\")","v":""},{"$f":"IFERROR(INDEX(Admin!$M$34:$P$177,MATCH(Results!$B261,Admin!$S$34:$S$177,0),3),\"\")","v":""},{"$f":"IFERROR(INDEX(Admin!$M$34:$P$177,MATCH(Results!$B261,Admin!$S$34:$S$177,0),4),\"\")","v":""}]
[null,null,null,null,null,null,null,null,null,null,null,null,null,{"$f":"IFERROR(INDEX(Admin!$M$34:$P$177,MATCH(Results!$B262,Admin!$S$34:$S$177,0),1),\"\")","v":""},{"$f":"IFERROR(INDEX(Admin!$M$34:$P$177,MATCH(Results!$B262,Admin!$S$34:$S$177,0),3),\"\")","v":""},{"$f":"IFERROR(INDEX(Admin!$M$34:$P$177,MATCH(Results!$B262,Admin!$S$34:$S$177,0),4),\"\")","v":""}]
[null,null,null,null,null,null,null,null,null,null,null,null,null,{"$f":"IFERROR(INDEX(Admin!$M$34:$P$177,MATCH(Results!$B263,Admin!$S$34:$S$177,0),1),\"\")","v":""},{"$f":"IFERROR(INDEX(Admin!$M$34:$P$177,MATCH(Results!$B263,Admin!$S$34:$S$177,0),3),\"\")","v":""},{"$f":"IFERROR(INDEX(Admin!$M$34:$P$177,MATCH(Results!$B263,Admin!$S$34:$S$177,0),4),\"\")","v":""}]
[null,null,null,null,null,null,null,null,null,null,null,null,null,{"$f":"IFERROR(INDEX(Admin!$M$34:$P$177,MATCH(Results!$B264,Admin!$S$34:$S$177,0),1),\"\")","v":""},{"$f":"IFERROR(INDEX(Admin!$M$34:$P$177,MATCH(Results!$B264,Admin!$S$34:$S$177,0),3),\"\")","v":""},{"$f":"IFERROR(INDEX(Admin!$M$34:$P$177,MATCH(Results!$B264,Admin!$S$34:$S$177,0),4),\"\")","v":""}]
[null,null,null,null,null,null,null,null,null,null,null,null,null,{"$f":"IFERROR(INDEX(Admin!$M$34:$P$177,MATCH(Results!$B265,Admin!$S$34:$S$177,0),1),\"\")","v":""},{"$f":"IFERROR(INDEX(Admin!$M$34:$P$177,MATCH(Results!$B265,Admin!$S$34:$S$177,0),3),\"\")","v":""},{"$f":"IFERROR(INDEX(Admin!$M$34:$P$177,MATCH(Results!$B265,Admin!$S$34:$S$177,0),4),\"\")","v":""}]
[null,null,null,null,null,null,null,null,null,null,null,null,null,{"$f":"IFERROR(INDEX(Admin!$M$34:$P$177,MATCH(Results!$B266,Admin!$S$34:$S$177,0),1),\"\")","v":""},{"$f":"IFERROR(INDEX(Admin!$M$34:$P$177,MATCH(Results!$B266,Admin!$S$34:$S$177,0),3),\"\")","v":""},{"$f":"IFERROR(INDEX(Admin!$M$34:$P$177,MATCH(Results!$B266,Admin!$S$34:$S$177,0),4),\"\")","v":""}]
[null,null,null,null,null,null,null,null,null,null,null,null,null,{"$f":"IFERROR(INDEX(Admin!$M$34:$P$177,MATCH(Results!$B267,Admin!$S$34:$S$177,0),1),\"\")","v":""},{"$f":"IFERROR(INDEX(Admin!$M$34:$P$177,MATCH(Results!$B267,Admin!$S$34:$S$177,0),3),\"\")","v":""},{"$f":"IFERROR(INDEX(Admin!$M$34:$P$177,MATCH(Results!$B267,Admin!$S$34:$S$177,0),4),\"\")","v":""}]
[null,null,null,null,null,null,null,null,null,null,null,null,null,{"$f":"IFERROR(INDEX(Admin!$M$34:$P$177,MATCH(Results!$B268,Admin!$S$34:$S$177,0),1),\"\")","v":""},{"$f":"IFERROR(INDEX(Admin!$M$34:$P$177,MATCH(Results!$B268,Admin!$S$34:$S$177,0),3),\"\")","v":""},{"$f":"IFERROR(INDEX(Admin!$M$34:$P$177,MATCH(Results!$B268,Admin!$S$34:$S$177,0),4),\"\")","v":""}]
[null,null,null,null,null,null,null,null,null,null,null,null,null,{"$f":"IFERROR(INDEX(Admin!$M$34:$P$177,MATCH(Results!$B269,Admin!$S$34:$S$177,0),1),\"\")","v":""},{"$f":"IFERROR(INDEX(Admin!$M$34:$P$177,MATCH(Results!$B269,Admin!$S$34:$S$177,0),3),\"\")","v":""},{"$f":"IFERROR(INDEX(Admin!$M$34:$P$177,MATCH(Results!$B269,Admin!$S$34:$S$177,0),4),\"\")","v":""}]
[null,null,null,null,null,null,null,null,null,null,null,null,null,{"$f":"IFERROR(INDEX(Admin!$M$34:$P$177,MATCH(Results!$B270,Admin!$S$34:$S$177,0),1),\"\")","v":""},{"$f":"IFERROR(INDEX(Admin!$M$34:$P$177,MATCH(Results!$B270,Admin!$S$34:$S$177,0),3),\"\")","v":""},{"$f":"IFERROR(INDEX(Admin!$M$34:$P$177,MATCH(Results!$B270,Admin!$S$34:$S$177,0),4),\"\")","v":""}]
[null,null,null,null,null,null,null,null,null,null,null,null,null,{"$f":"IFERROR(INDEX(Admin!$M$34:$P$177,MATCH(Results!$B271,Admin!$S$34:$S$177,0),1),\"\")","v":""},{"$f":"IFERROR(INDEX(Admin!$M$34:$P$177,MATCH(Results!$B271,Admin!$S$34:$S$177,0),3),\"\")","v":""},{"$f":"IFERROR(INDEX(Admin!$M$34:$P$177,MATCH(Results!$B271,Admin!$S$34:$S$177,0),4),\"\")","v":""}]
[null,null,null,null,null,null,null,null,null,null,null,null,null,{"$f":"IFERROR(INDEX(Admin!$M$34:$P$177,MATCH(Results!$B272,Admin!$S$34:$S$177,0),1),\"\")","v":""},{"$f":"IFERROR(INDEX(Admin!$M$34:$P$177,MATCH(Results!$B272,Admin!$S$34:$S$177,0),3),\"\")","v":""},{"$f":"IFERROR(INDEX(Admin!$M$34:$P$177,MATCH(Results!$B272,Admin!$S$34:$S$177,0),4),\"\")","v":""}]
[null,null,null,null,null,null,null,null,null,null,null,null,null,{"$f":"IFERROR(INDEX(Admin!$M$34:$P$177,MATCH(Results!$B273,Admin!$S$34:$S$177,0),1),\"\")","v":""},{"$f":"IFERROR(INDEX(Admin!$M$34:$P$177,MATCH(Results!$B273,Admin!$S$34:$S$177,0),3),\"\")","v":""},{"$f":"IFERROR(INDEX(Admin!$M$34:$P$177,MATCH(Results!$B273,Admin!$S$34:$S$177,0),4),\"\")","v":""}]
[null,null,null,null,null,null,null,null,null,null,null,null,null,{"$f":"IFERROR(INDEX(Admin!$M$34:$P$177,MATCH(Results!$B274,Admin!$S$34:$S$177,0),1),\"\")","v":""},{"$f":"IFERROR(INDEX(Admin!$M$34:$P$177,MATCH(Results!$B274,Admin!$S$34:$S$177,0),3),\"\")","v":""},{"$f":"IFERROR(INDEX(Admin!$M$34:$P$177,MATCH(Results!$B274,Admin!$S$34:$S$177,0),4),\"\")","v":""}]
[null,null,null,null,null,null,null,null,null,null,null,null,null,{"$f":"IFERROR(INDEX(Admin!$M$34:$P$177,MATCH(Results!$B275,Admin!$S$34:$S$177,0),1),\"\")","v":""},{"$f":"IFERROR(INDEX(Admin!$M$34:$P$177,MATCH(Results!$B275,Admin!$S$34:$S$177,0),3),\"\")","v":""},{"$f":"IFERROR(INDEX(Admin!$M$34:$P$177,MATCH(Results!$B275,Admin!$S$34:$S$177,0),4),\"\")","v":""}]
[null,null,null,null,null,null,null,null,null,null,null,null,null,{"$f":"IFERROR(INDEX(Admin!$M$34:$P$177,MATCH(Results!$B276,Admin!$S$34:$S$177,0),1),\"\")","v":""},{"$f":"IFERROR(INDEX(Admin!$M$34:$P$177,MATCH(Results!$B276,Admin!$S$34:$S$177,0),3),\"\")","v":""},{"$f":"IFERROR(INDEX(Admin!$M$34:$P$177,MATCH(Results!$B276,Admin!$S$34:$S$177,0),4),\"\")","v":""}]
[null,null,null,null,null,null,null,null,null,null,null,null,null,{"$f":"IFERROR(INDEX(Admin!$M$34:$P$177,MATCH(Results!$B277,Admin!$S$34:$S$177,0),1),\"\")","v":""},{"$f":"IFERROR(INDEX(Admin!$M$34:$P$177,MATCH(Results!$B277,Admin!$S$34:$S$177,0),3),\"\")","v":""},{"$f":"IFERROR(INDEX(Admin!$M$34:$P$177,MATCH(Results!$B277,Admin!$S$34:$S$177,0),4),\"\")","v":""}]
[null,null,null,null,null,null,null,null,null,null,null,null,null,{"$f":"IFERROR(INDEX(Admin!$M$34:$P$177,MATCH(Results!$B278,Admin!$S$34:$S$177,0),1),\"\")","v":""},{"$f":"IFERROR(INDEX(Admin!$M$34:$P$177,MATCH(Results!$B278,Admin!$S$34:$S$177,0),3),\"\")","v":""},{"$f":"IFERROR(INDEX(Admin!$M$34:$P$177,MATCH(Results!$B278,Admin!$S$34:$S$177,0),4),\"\")","v":""}]
[null,null,null,null,null,null,null,null,null,null,null,null,null,{"$f":"IFERROR(INDEX(Admin!$M$34:$P$177,MATCH(Results!$B279,Admin!$S$34:$S$177,0),1),\"\")","v":""},{"$f":"IFERROR(INDEX(Admin!$M$34:$P$177,MATCH(Results!$B279,Admin!$S$34:$S$177,0),3),\"\")","v":""},{"$f":"IFERROR(INDEX(Admin!$M$34:$P$177,MATCH(Results!$B279,Admin!$S$34:$S$177,0),4),\"\")","v":""}]
[null,null,null,null,null,null,null,null,null,null,null,null,null,{"$f":"IFERROR(INDEX(Admin!$M$34:$P$177,MATCH(Results!$B280,Admin!$S$34:$S$177,0),1),\"\")","v":""},{"$f":"IFERROR(INDEX(Admin!$M$34:$P$177,MATCH(Results!$B280,Admin!$S$34:$S$177,0),3),\"\")","v":""},{"$f":"IFERROR(INDEX(Admin!$M$34:$P$177,MATCH(Results!$B280,Admin!$S$34:$S$177,0),4),\"\")","v":""}]
[null,null,null,null,null,null,null,null,null,null,null,null,null,{"$f":"IFERROR(INDEX(Admin!$M$34:$P$177,MATCH(Results!$B281,Admin!$S$34:$S$177,0),1),\"\")","v":""},{"$f":"IFERROR(INDEX(Admin!$M$34:$P$177,MATCH(Results!$B281,Admin!$S$34:$S$177,0),3),\"\")","v":""},{"$f":"IFERROR(INDEX(Admin!$M$34:$P$177,MATCH(Results!$B281,Admin!$S$34:$S$177,0),4),\"\")","v":""}]
[null,null,null,null,null,null,null,null,null,null,null,null,null,{"$f":"IFERROR(INDEX(Admin!$M$34:$P$177,MATCH(Results!$B282,Admin!$S$34:$S$177,0),1),\"\")","v":""},{"$f":"IFERROR(INDEX(Admin!$M$34:$P$177,MATCH(Results!$B282,Admin!$S$34:$S$177,0),3),\"\")","v":""},{"$f":"IFERROR(INDEX(Admin!$M$34:$P$177,MATCH(Results!$B282,Admin!$S$34:$S$177,0),4),\"\")","v":""}]
[null,null,null,null,null,null,null,null,null,null,null,null,null,{"$f":"IFERROR(INDEX(Admin!$M$34:$P$177,MATCH(Results!$B283,Admin!$S$34:$S$177,0),1),\"\")","v":""},{"$f":"IFERROR(INDEX(Admin!$M$34:$P$177,MATCH(Results!$B283,Admin!$S$34:$S$177,0),3),\"\")","v":""},{"$f":"IFERROR(INDEX(Admin!$M$34:$P$177,MATCH(Results!$B283,Admin!$S$34:$S$177,0),4),\"\")","v":""}]
[null,null,null,null,null,null,null,null,null,null,null,null,null,{"$f":"IFERROR(INDEX(Admin!$M$34:$P$177,MATCH(Results!$B284,Admin!$S$34:$S$177,0),1),\"\")","v":""},{"$f":"IFERROR(INDEX(Admin!$M$34:$P$177,MATCH(Results!$B284,Admin!$S$34:$S$177,0),3),\"\")","v":""},{"$f":"IFERROR(INDEX(Admin!$M$34:$P$177,MATCH(Results!$B284,Admin!$S$34:$S$177,0),4),\"\")","v":""}]
[null,null,null,null,null,null,null,null,null,null,null,null,null,{"$f":"IFERROR(INDEX(Admin!$M$34:$P$177,MATCH(Results!$B285,Admin!$S$34:$S$177,0),1),\"\")","v":""},{"$f":"IFERROR(INDEX(Admin!$M$34:$P$177,MATCH(Results!$B285,Admin!$S$34:$S$177,0),3),\"\")","v":""},{"$f":"IFERROR(INDEX(Admin!$M$34:$P$177,MATCH(Results!$B285,Admin!$S$34:$S$177,0),4),\"\")","v":""}]
[null,null,null,null,null,null,null,null,null,null,null,null,null,{"$f":"IFERROR(INDEX(Admin!$M$34:$P$177,MATCH(Results!$B286,Admin!$S$34:$S$177,0),1),\"\")","v":""},{"$f":"IFERROR(INDEX(Admin!$M$34:$P$177,MATCH(Results!$B286,Admin!$S$34:$S$177,0),3),\"\")","v":""},{"$f":"IFERROR(INDEX(Admin!$M$34:$P$177,MATCH(Results!$B286,Admin!$S$34:$S$177,0),4),\"\")","v":""}]
[null,null,null,null,null,null,null,null,null,null,null,null,null,{"$f":"IFERROR(INDEX(Admin!$M$34:$P$177,MATCH(Results!$B287,Admin!$S$34:$S$177,0),1),\"\")","v":""},{"$f":"IFERROR(INDEX(Admin!$M$34:$P$177,MATCH(Results!$B287,Admin!$S$34:$S$177,0),3),\"\")","v":""},{"$f":"IFERROR(INDEX(Admin!$M$34:$P$177,MATCH(Results!$B287,Admin!$S$34:$S$177,0),4),\"\")","v":""}]
[null,null,null,null,null,null,null,null,null,null,null,null,null,{"$f":"IFERROR(INDEX(Admin!$M$34:$P$177,MATCH(Results!$B288,Admin!$S$34:$S$177,0),1),\"\")","v":""},{"$f":"IFERROR(INDEX(Admin!$M$34:$P$177,MATCH(Results!$B288,Admin!$S$34:$S$177,0),3),\"\")","v":""},{"$f":"IFERROR(INDEX(Admin!$M$34:$P$177,MATCH(Results!$B288,Admin!$S$34:$S$177,0),4),\"\")","v":""}]
[null,null,null,null,null,null,null,null,null,null,null,null,null,{"$f":"IFERROR(INDEX(Admin!$M$34:$P$177,MATCH(Results!$B289,Admin!$S$34:$S$177,0),1),\"\")","v":""},{"$f":"IFERROR(INDEX(Admin!$M$34:$P$177,MATCH(Results!$B289,Admin!$S$34:$S$177,0),3),\"\")","v":""},{"$f":"IFERROR(INDEX(Admin!$M$34:$P$177,MATCH(Results!$B289,Admin!$S$34:$S$177,0),4),\"\")","v":""}]
[null,null,null,null,null,null,null,null,null,null,null,null,null,{"$f":"IFERROR(INDEX(Admin!$M$34:$P$177,MATCH(Results!$B290,Admin!$S$34:$S$177,0),1),\"\")","v":""},{"$f":"IFERROR(INDEX(Admin!$M$34:$P$177,MATCH(Results!$B290,Admin!$S$34:$S$177,0),3),\"\")","v":""},{"$f":"IFERROR(INDEX(Admin!$M$34:$P$177,MATCH(Results!$B290,Admin!$S$34:$S$177,0),4),\"\")","v":""}]

{"sheet":"Start","index":1,"n_rows":28,"n_cols":18,"rows_kept":28,"cut":false,"hidden":false,"merged":[]}
[]
[null,null,null,null,null,null,null,null,null,null,null,null,null,null,null,null,null,"Please select"]
[null,null,null,null,null,null,null,null,null,null,null,null,null,null,null,null,null,"Project Manager"]
[null,null,null,null,null,null,null,null,null,null,null,null,null,null,null,null,null,"Project Support"]
[]
[]
[null,null,null,null,null,null,null,null,null,null,null,null,null,null,null,null,null,"Programme Manager"]
[null,null,null,null,null,null,null,null,null,null,null,null,null,null,null,null,null,"Administrative/Clerical Officer"]
[null,null,null,null,null,null,null,null,null,null,null,null,null,null,null,null,null,"Trainee/Junior Project Manager"]
[null,null,null,null,null,null,null,null,null,null,null,null,null,null,null,null,null,"Other"]
[null,null,null,null,null,null,null,null,null,null,null,null,null,null,null,null,null,"Please select"]
[]
[null,null,null,null,null,null,null,null,null,null,null,null,null,null,null,null,null,"Dorset CCG"]
[]
[]
[]
[]
[]
[]
[]
[]
[]
[]
[]
[null,null,null,null,null,null,null,null,null,null,null,null,null,null,null,null,null,"Dorset Healthcare"]
[null,null,null,null,null,null,null,null,null,null,null,null,null,null,null,null,null,"Dorset Council"]
[null,null,null,null,null,null,null,null,null,null,null,null,null,null,null,null,null,"BCP Council"]
[null,null,null,null,null,null,null,null,null,null,null,null,null,null,null,null,null,"Poole Hospital"]

{"sheet":"Home","index":2,"n_rows":42,"n_cols":19,"rows_kept":42,"cut":false,"hidden":false,"merged":[[41,13,42,14],[23,6,24,7],[26,6,27,7],[29,6,30,7],[32,6,33,7],[35,6,36,7],[38,6,39,7],[41,6,42,7],[26,13,27,14],[29,13,30,14],[32,13,33,14],[35,13,36,14],[38,13,39,14]]}
[]
[null,null,null,null,null,null,null,null,null,null,null,null,null,null,null,null,null,"Please select"]
[null,null,null,null,null,null,null,null,null,null,null,null,null,null,null,null,null,"Project Manager"]
[null,null,null,null,null,null,null,null,null,null,null,null,null,null,null,null,null,"Project Support"]
[null,null,null,null,null,null,null,null,null,null,null,null,null,null,null,null,null,"Programme Manager"]
[null,null,null,null,null,null,null,null,null,null,null,null,null,null,null,null,null,"Administrative/Clerical Officer"]
[null,null,null,null,null,null,null,null,null,null,null,null,null,null,null,null,null,"Trainee/Junior Project Manager"]
[null,null,null,null,null,null,null,null,null,null,null,null,null,null,null,null,null,"Other"]
[null,null,null,null,null,null,null,null,null,null,null,null,null,null,null,null,null,"Please select"]
[]
[null,null,null,null,null,null,null,null,null,null,null,null,null,null,null,null,null,"Dorset CCG"]
[]
[]
[]
[]
[]
[]
[]
[]
[null,null,null,null,null,null,null,null,null,null,null,null,null,null,null,null,null,"Dorset Healthcare"]
[null,null,null,null,null,null,null,null,null,null,null,null,null,null,null,null,null,"Dorset Council"]
[null,null,null,null,null,null,null,null,null,null,null,null,null,null,null,null,null,"BCP Council"]
[null,null,null,null,null,null,null,null,null,null,null,null,null,null,null,null,null,"Poole Hospital"]
[null,null,null,null,null,null,{"$f":"Admin!C111","v":"Not started"},null,null,null,null,null,null,null,null,null,null,"Bournemouth Hospital"]
[null,null,null,null,null,null,null,null,null,null,null,null,null,null,null,null,null,"Dorset County Hospital"]
[null,null,null,null,null,null,null,null,null,null,null,null,null,null,null,null,null,"Public Health "]
[null,null,null,null,null,null,{"$f":"Admin!C99","v":"Not started"},null,null,null,null,null,null,{"$f":"Admin!C105","v":"Not started"},null,null,null,"Other","  "]
[null,null,null,null,null,null,null,null,null,null,null,null,null,null,null,null,null,"Please select"]
[]
[null,null,null,null,null,null,{"$f":"Admin!C100","v":"Not started"},null,null,null,null,null,null,{"$f":"Admin!C106","v":"Not started"}]
[]
[]
[null,null,null,null,null,null,{"$f":"Admin!C101","v":"Not started"},null,null,null,null,null,null,{"$f":"Admin!C107","v":"Not started"}]
[]
[]
[null,null,null,null,null,null,{"$f":"Admin!C102","v":"Not started"},null,null,null,null,null,null,{"$f":"Admin!C108","v":"Not started"}]
[]
[]
[null,null,null,null,null,null,{"$f":"Admin!C103","v":"Not started"},null,null,null,null,null,null,{"$f":"Admin!C109","v":"Not started"}]
[]
[]
[null,null,null,null,null,null,{"$f":"Admin!C104","v":"Not started"},null,null,null,null,null,null,{"$f":"Admin!C110","v":"Not started"}]

{"sheet":"Results","index":3,"n_rows":290,"n_cols":14,"rows_kept":290,"cut":false,"hidden":true,"merged":[[89,9,90,14],[91,4,94,4],[91,5,94,8],[99,4,102,4],[103,4,106,4],[121,11,122,13],[123,11,123,13],[124,11,124,13],[125,11,125,13],[126,11,126,13],[89,4,90,4],[89,5,90,8],[144,2,145,5],[144,6,145,12],[121,4,122,4],[126,5,126,8],[127,5,127,8],[130,5,130,8],[131,5,131,8],[129,9,129,10],[130,9,130,10],[131,9,131,10],[132,9,132,10],[133,9,133,10],[91,9,94,14],[95,9,98,14],[99,9,102,14],[103,9,106,14],[107,9,110,14],[121,9,122,10],[123,9,123,10],[124,9,124,10],[125,9,125,10],[144,13,145,14],[134,9,134,10],[147,13,147,14],[99,5,102,8],[103,5,106,8],[147,2,147,5],[107,4,110,4],[107,5,110,8],[121,5,122,8],[123,5,123,8],[124,5,124,8],[125,5,125,8],[146,6,146,12],[147,6,147,12],[128,9,128,10],[134,5,134,8],[128,5,128,8],[130,11,130,13],[131,11,131,13],[132,11,132,13],[159,13,159,14],[160,13,160,14],[153,13,153,14],[154,13,154,14],[155,13,155,14],[159,6,159,12],[160,6,160,12],[95,5,98,8],[95,4,98,4],[151,13,151,14],[152,13,152,14],[151,2,151,5],[152,2,152,5],[129,11,129,13],[150,2,150,5],[150,6,150,12],[150,13,150,14],[148,13,148,14],[129,5,129,8],[132,5,132,8],[133,5,133,8],[146,2,146,5],[148,2,148,5],[149,2,149,5],[126,9,126,10],[127,9,127,10],[148,6,148,12],[149,6,149,12],[146,13,146,14],[149,13,149,14],[156,6,156,12],[157,6,157,12],[158,6,158,12],[151,6,151,12],[152,6,152,12],[153,6,153,12],[154,6,154,12],[155,6,155,12],[127,11,127,13],[128,11,128,13],[156,13,156,14],[157,13,157,14],[158,13,158,14],[133,11,133,13],[134,11,134,13],[166,13,166,14],[167,13,167,14],[168,13,168,14],[169,13,169,14],[170,13,170,14],[161,13,161,14],[162,13,162,14],[163,13,163,14],[164,13,164,14],[165,13,165,14],[176,13,176,14],[177,13,177,14],[178,13,178,14],[179,13,179,14],[180,13,180,14],[171,13,171,14],[172,13,172,14],[173,13,173,14],[174,13,174,14],[175,13,175,14],[186,13,186,14],[187,13,187,14],[188,13,188,14],[189,13,189,14],[190,13,190,14],[181,13,181,14],[182,13,182,14],[183,13,183,14],[184,13,184,14],[185,13,185,14],[196,13,196,14],[197,13,197,14],[198,13,198,14],[199,13,199,14],[200,13,200,14],[191,13,191,14],[192,13,192,14],[193,13,193,14],[194,13,194,14],[195,13,195,14],[206,13,206,14],[207,13,207,14],[208,13,208,14],[209,13,209,14],[210,13,210,14],[201,13,201,14],[202,13,202,14],[203,13,203,14],[204,13,204,14],[205,13,205,14],[216,13,216,14],[217,13,217,14],[218,13,218,14],[219,13,219,14],[220,13,220,14],[211,13,211,14],[212,13,212,14],[213,13,213,14],[214,13,214,14],[215,13,215,14],[226,13,226,14],[227,13,227,14],[228,13,228,14],[229,13,229,14],[230,13,230,14],[221,13,221,14],[222,13,222,14],[223,13,223,14],[224,13,224,14],[225,13,225,14],[236,13,236,14],[237,13,237,14],[238,13,238,14],[239,13,239,14],[240,13,240,14],[231,13,231,14],[232,13,232,14],[233,13,233,14],[234,13,234,14],[235,13,235,14],[246,13,246,14],[247,13,247,14],[248,13,248,14],[249,13,249,14],[250,13,250,14],[241,13,241,14],[242,13,242,14],[243,13,243,14],[244,13,244,14],[245,13,245,14],[256,13,256,14],[257,13,257,14],[258,13,258,14],[259,13,259,14],[260,13,260,14],[251,13,251,14],[252,13,252,14],[253,13,253,14],[254,13,254,14],[255,13,255,14],[266,13,266,14],[267,13,267,14],[268,13,268,14],[269,13,269,14],[270,13,270,14],[261,13,261,14],[262,13,262,14],[263,13,263,14],[264,13,264,14],[265,13,265,14],[277,13,277,14],[278,13,278,14],[279,13,279,14],[280,13,280,14],[271,13,271,14],[272,13,272,14],[273,13,273,14],[274,13,274,14],[275,13,275,14],[169,2,169,5],[170,2,170,5],[171,2,171,5],[172,2,172,5],[173,2,173,5],[157,2,157,5],[158,2,158,5],[159,2,159,5],[160,2,160,5],[161,2,161,5],[162,2,162,5],[163,2,163,5],[164,2,164,5],[165,2,165,5],[166,2,166,5],[167,2,167,5],[168,2,168,5],[179,2,179,5],[180,2,180,5],[181,2,181,5],[182,2,182,5],[183,2,183,5],[174,2,174,5],[175,2,175,5],[176,2,176,5],[177,2,177,5],[178,2,178,5],[189,2,189,5],[190,2,190,5],[191,2,191,5],[192,2,192,5],[193,2,193,5],[184,2,184,5],[185,2,185,5],[186,2,186,5],[187,2,187,5],[188,2,188,5],[199,2,199,5],[200,2,200,5],[201,2,201,5],[202,2,202,5],[203,2,203,5],[194,2,194,5],[195,2,195,5],[196,2,196,5],[197,2,197,5],[198,2,198,5],[209,2,209,5],[210,2,210,5],[211,2,211,5],[212,2,212,5],[213,2,213,5],[204,2,204,5],[205,2,205,5],[206,2,206,5],[207,2,207,5],[208,2,208,5],[219,2,219,5],[220,2,220,5],[221,2,221,5],[222,2,222,5],[223,2,223,5],[214,2,214,5],[215,2,215,5],[216,2,216,5],[217,2,217,5],[218,2,218,5],[229,2,229,5],[230,2,230,5],[231,2,231,5],[232,2,232,5],[233,2,233,5],[224,2,224,5],[225,2,225,5],[226,2,226,5],[227,2,227,5],[228,2,228,5],[239,2,239,5],[240,2,240,5],[241,2,241,5],[242,2,242,5],[243,2,243,5],[234,2,234,5],[235,2,235,5],[236,2,236,5],[237,2,237,5],[238,2,238,5],[249,2,249,5],[250,2,250,5],[251,2,251,5],[252,2,252,5],[253,2,253,5],[244,2,244,5],[245,2,245,5],[246,2,246,5],[247,2,247,5],[248,2,248,5],[266,2,266,5],[267,2,267,5],[268,2,268,5],[259,2,259,5],[260,2,260,5],[261,2,261,5],[262,2,262,5],[263,2,263,5],[254,2,254,5],[255,2,255,5],[256,2,256,5],[257,2,257,5],[258,2,258,5],[153,2,153,5],[154,2,154,5],[155,2,155,5],[156,2,156,5],[284,2,284,5],[285,2,285,5],[286,2,286,5],[279,2,279,5],[280,2,280,5],[281,2,281,5],[282,2,282,5],[283,2,283,5],[274,2,274,5],[275,2,275,5],[276,2,276,5],[277,2,277,5],[278,2,278,5],[269,2,269,5],[270,2,270,5],[271,2,271,5],[272,2,272,5],[273,2,273,5],[264,2,264,5],[265,2,265,5],[166,6,166,12],[167,6,167,12],[168,6,168,12],[169,6,169,12],[170,6,170,12],[161,6,161,12],[162,6,162,12],[163,6,163,12],[164,6,164,12],[165,6,165,12],[176,6,176,12],[177,6,177,12],[178,6,178,12],[179,6,179,12],[180,6,180,12],[171,6,171,12],[172,6,172,12],[173,6,173,12],[174,6,174,12],[175,6,175,12],[186,6,186,12],[187,6,187,12],[188,6,188,12],[189,6,189,12],[190,6,190,12],[181,6,181,12],[182,6,182,12],[183,6,183,12],[184,6,184,12],[185,6,185,12],[196,6,196,12],[197,6,197,12],[198,6,198,12],[199,6,199,12],[200,6,200,12],[191,6,191,12],[192,6,192,12],[193,6,193,12],[194,6,194,12],[195,6,195,12],[206,6,206,12],[207,6,207,12],[208,6,208,12],[209,6,209,12],[210,6,210,12],[201,6,201,12],[202,6,202,12],[203,6,203,12],[204,6,204,12],[205,6,205,12],[216,6,216,12],[217,6,217,12],[218,6,218,12],[219,6,219,12],[220,6,220,12],[211,6,211,12],[212,6,212,12],[213,6,213,12],[214,6,214,12],[215,6,215,12],[226,6,226,12],[227,6,227,12],[228,6,228,12],[229,6,229,12],[230,6,230,12],[221,6,221,12],[222,6,222,12],[223,6,223,12],[224,6,224,12],[225,6,225,12],[236,6,236,12],[237,6,237,12],[238,6,238,12],[239,6,239,12],[240,6,240,12],[231,6,231,12],[232,6,232,12],[233,6,233,12],[234,6,234,12],[235,6,235,12],[246,6,246,12],[247,6,247,12],[248,6,248,12],[249,6,249,12],[250,6,250,12],[241,6,241,12],[242,6,242,12],[243,6,243,12],[244,6,244,12],[245,6,245,12],[256,6,256,12],[257,6,257,12],[258,6,258,12],[259,6,259,12],[260,6,260,12],[251,6,251,12],[252,6,252,12],[253,6,253,12],[254,6,254,12],[255,6,255,12],[266,6,266,12],[267,6,267,12],[268,6,268,12],[269,6,269,12],[270,6,270,12],[261,6,261,12],[262,6,262,12],[263,6,263,12],[264,6,264,12],[265,6,265,12],[271,6,271,12],[272,6,272,12],[273,6,273,12],[274,6,274,12],[275,6,275,12],[286,6,286,12],[287,6,287,12],[288,6,288,12],[289,6,289,12],[281,6,281,12],[282,6,282,12],[283,6,283,12],[284,6,284,12],[285,6,285,12],[290,2,290,5],[291,2,291,5],[290,6,290,12],[291,6,291,12],[290,13,290,14],[291,13,291,14],[276,6,276,12],[277,6,277,12],[278,6,278,12],[279,6,279,12],[280,6,280,12],[289,2,289,5],[287,2,287,5],[288,2,288,5],[286,13,286,14],[287,13,287,14],[288,13,288,14],[289,13,289,14],[281,13,281,14],[282,13,282,14],[283,13,283,14],[284,13,284,14],[285,13,285,14],[276,13,276,14]]}
[]
[]
[]
[]
[]
[]
[]
[]
[]
[]
[]
[]
[]
[]
[]
[]
[]
[]
[]
[]
[]
[]
[]
[]
[]
[]
[]
[]
[]
[]
[]
[]
[]
[]
[]
[]
[]
[]
[]
[]
[]
[]
[]
[]
[]
[]
[]
[]
[]
[]
[]
[]
[]
[]
[]
[]
[]
[]
[]
[]
[]
[]
[]
[]
[]
[]
[]
[]
[]
[]
[]
[]
[]
[]
[]
[]
[]
[]
[]
[]
[]
[]
[]
[]
[]
[]
[]
[]
[]
[null,null,null,null,"Rank","Competency",null,null,null," Sub Competencies"]
[]
[null,null,null,null,1,{"$f":"Admin!CB34","v":"Leadership and Team Management "},null,null,null,{"$f":"Admin!CD34","v":"People Management, Model Desirable Behaviour, Leading a project, Matrix Management & People Management"}]
[]
[]
[]
[null,null,null,null,2,{"$f":"Admin!CB35","v":"Resources Management"},null,null,null,{"$f":"Admin!CD35","v":"Resource Identification, Procurement Process, Supplier Management & Resource Planning Techniques"}]
[]
[]
[]
[null,null,null,null,3,{"$f":"Admin!CB36","v":"Professionalism "},null,null,null,{"$f":"Admin!CD36","v":"Culture, Community of practice, Conflicts of Interest, Ethics and compliance & Personal and professional development"}]
[]
[]
[]
[null,null,null,null,4,{"$f":"Admin!CB37","v":"Project Delivery"},null,null,null,{"$f":"Admin!CD37","v":"Handover to BAU, Change Management, Quality Improvement Process, Benefits management & Lessons learned "}]
[]
[]
[]
[null,null,null,null,5,{"$f":"Admin!CB38","v":"Communication Management"},null,null,null,{"$f":"Admin!CD38","v":"Creating the comms and engagement plan, Effective 2-way conversation, Presentation skills and facilitation & Stakeholder identification and mapping "}]
[]
[]
[]
[]
[]
[]
[]
[]
[]
[]
[]
[]
[]
[null,null,null,null,"Rank","Competency",null,null,null,"Personal \nimportance Score",null,"Weighted Competence Score (Out of 100)"]
[]
[null,null,null,null,1,{"$f":"Admin!CB4","v":"Leadership and Team Management "},null,null,null,{"$f":"Admin!CI4","v":1},null,{"$f":"Admin!CW4","v":8}]
[null,null,null,null,2,{"$f":"Admin!CB5","v":"Resources Management"},null,null,null,{"$f":"Admin!CI5","v":1},null,{"$f":"Admin!CW5","v":8}]
[null,null,null,null,3,{"$f":"Admin!CB6","v":"Professionalism "},null,null,null,{"$f":"Admin!CI6","v":1},null,{"$f":"Admin!CW6","v":8}]
[null,null,null,null,4,{"$f":"Admin!CB7","v":"Project Delivery"},null,null,null,{"$f":"Admin!CI7","v":1},null,{"$f":"Admin!CW7","v":8}]
[null,null,null,null,5,{"$f":"Admin!CB8","v":"Communication Management"},null,null,null,{"$f":"Admin!CI8","v":1},null,{"$f":"Admin!CW8","v":8}]
[null,null,null,null,6,{"$f":"Admin!CB9","v":"Conflict Management"},null,null,null,{"$f":"Admin!CI9","v":1},null,{"$f":"Admin!CW9","v":8}]
[null,null,null,null,7,{"$f":"Admin!CB10","v":"Planning for success"},null,null,null,{"$f":"Admin!CI10","v":1},null,{"$f":"Admin!CW10","v":8}]
[null,null,null,null,8,{"$f":"Admin!CB11","v":"Scope Management"},null,null,null,{"$f":"Admin!CI11","v":1},null,{"$f":"Admin!CW11","v":8}]
[null,null,null,null,9,{"$f":"Admin!CB12","v":"Risk and Issue Management"},null,null,null,{"$f":"Admin!CI12","v":1},null,{"$f":"Admin!CW12","v":8}]
[null,null,null,null,10,{"$f":"Admin!CB13","v":"Project Finances"},null,null,null,{"$f":"Admin!CI13","v":1},null,{"$f":"Admin!CW13","v":8}]
[null,null,null,null,11,{"$f":"Admin!CB14","v":"Project Structure and Governance"},null,null,null,{"$f":"Admin!CI14","v":1},null,{"$f":"Admin!CW14","v":8}]
[null,null,null,null,12,{"$f":"Admin!CB15","v":"Quality Management and Assurance"},null,null,null,{"$f":"Admin!CI15","v":1},null,{"$f":"Admin!CW15","v":8}]
[]
[]
[]
[]
[]
[]
[]
[]
[]
[null,null,"Competency",null,null,null,"Action",null,null,null,null,null,null,"Deadline"]
[]
[null,1,"Leadership and Team Management",null,null,null,"e.g. I will aim to provide constructive peer feedback on at least one occasion within the next four weeks",null,null,null,null,null,null,"2020-01-01"]
[null,2,"",null,null,null,"",null,null,null,null,null,null,""]
[null,3,"",null,null,null,"",null,null,null,null,null,null,""]
[null,4,"",null,null,null,"",null,null,null,null,null,null,""]
[null,5,"",null,null,null,"",null,null,null,null,null,null,""]
[null,6,"",null,null,null,"",null,null,null,null,null,null,""]
[null,7,"",null,null,null,"",null,null,null,null,null,null,""]
[null,8,"",null,null,null,"",null,null,null,null,null,null,""]
[null,9,"",null,null,null,"",null,null,null,null,null,null,""]
[null,10,"",null,null,null,"",null,null,null,null,null,null,""]
[null,11,"",null,null,null,"",null,null,null,null,null,null,""]
[null,12,"",null,null,null,"",null,null,null,null,null,null,""]
[null,13,"",null,null,null,"",null,null,null,null,null,null,""]
[null,14,"",null,null,null,"",null,null,null,null,null,null,""]
[null,15,"",null,null,null,"",null,null,null,null,null,null,""]
[null,16,"",null,null,null,"",null,null,null,null,null,null,""]
[null,17,"",null,null,null,"",null,null,null,null,null,null,""]
[null,18,"",null,null,null,"",null,null,null,null,null,null,""]
[null,19,"",null,null,null,"",null,null,null,null,null,null,""]
[null,20,"",null,null,null,"",null,null,null,null,null,null,""]
[null,21,"",null,null,null,"",null,null,null,null,null,null,""]
[null,22,"",null,null,null,"",null,null,null,null,null,null,""]
[null,23,"",null,null,null,"",null,null,null,null,null,null,""]
[null,24,"",null,null,null,"",null,null,null,null,null,null,""]
[null,25,"",null,null,null,"",null,null,null,null,null,null,""]
[null,26,"",null,null,null,"",null,null,null,null,null,null,""]
[null,27,"",null,null,null,"",null,null,null,null,null,null,""]
[null,28,"",null,null,null,"",null,null,null,null,null,null,""]
[null,29,"",null,null,null,"",null,null,null,null,null,null,""]
[null,30,"",null,null,null,"",null,null,null,null,null,null,""]
[null,31,"",null,null,null,"",null,null,null,null,null,null,""]
[null,32,"",null,null,null,"",null,null,null,null,null,null,""]
[null,33,"",null,null,null,"",null,null,null,null,null,null,""]
[null,34,"",null,null,null,"",null,null,null,null,null,null,""]
[null,35,"",null,null,null,"",null,null,null,null,null,null,""]
[null,36,"",null,null,null,"",null,null,null,null,null,null,""]
[null,37,"",null,null,null,"",null,null,null,null,null,null,""]
[null,38,"",null,null,null,"",null,null,null,null,null,null,""]
[null,39,"",null,null,null,"",null,null,null,null,null,null,""]
[null,40,"",null,null,null,"",null,null,null,null,null,null,""]
[null,41,"",null,null,null,"",null,null,null,null,null,null,""]
[null,42,"",null,null,null,"",null,null,null,null,null,null,""]
[null,43,"",null,null,null,"",null,null,null,null,null,null,""]
[null,44,"",null,null,null,"",null,null,null,null,null,null,""]
[null,45,"",null,null,null,"",null,null,null,null,null,null,""]
[null,46,"",null,null,null,"",null,null,null,null,null,null,""]
[null,47,"",null,null,null,"",null,null,null,null,null,null,""]
[null,48,"",null,null,null,"",null,null,null,null,null,null,""]
[null,49,"",null,null,null,"",null,null,null,null,null,null,""]
[null,50,"",null,null,null,"",null,null,null,null,null,null,""]
[null,51,"",null,null,null,"",null,null,null,null,null,null,""]
[null,52,"",null,null,null,"",null,null,null,null,null,null,""]
[null,53,"",null,null,null,"",null,null,null,null,null,null,""]
[null,54,"",null,null,null,"",null,null,null,null,null,null,""]
[null,55,"",null,null,null,"",null,null,null,null,null,null,""]
[null,56,"",null,null,null,"",null,null,null,null,null,null,""]
[null,57,"",null,null,null,"",null,null,null,null,null,null,""]
[null,58,"",null,null,null,"",null,null,null,null,null,null,""]
[null,59,"",null,null,null,"",null,null,null,null,null,null,""]
[null,60,"",null,null,null,"",null,null,null,null,null,null,""]
[null,61,"",null,null,null,"",null,null,null,null,null,null,""]
[null,62,"",null,null,null,"",null,null,null,null,null,null,""]
[null,63,"",null,null,null,"",null,null,null,null,null,null,""]
[null,64,"",null,null,null,"",null,null,null,null,null,null,""]
[null,65,"",null,null,null,"",null,null,null,null,null,null,""]
[null,66,"",null,null,null,"",null,null,null,null,null,null,""]
[null,67,"",null,null,null,"",null,null,null,null,null,null,""]
[null,68,"",null,null,null,"",null,null,null,null,null,null,""]
[null,69,"",null,null,null,"",null,null,null,null,null,null,""]
[null,70,"",null,null,null,"",null,null,null,null,null,null,""]
[null,71,"",null,null,null,"",null,null,null,null,null,null,""]
[null,72,"",null,null,null,"",null,null,null,null,null,null,""]
[null,73,"",null,null,null,"",null,null,null,null,null,null,""]
[null,74,"",null,null,null,"",null,null,null,null,null,null,""]
[null,75,"",null,null,null,"",null,null,null,null,null,null,""]
[null,76,"",null,null,null,"",null,null,null,null,null,null,""]
[null,77,"",null,null,null,"",null,null,null,null,null,null,""]
[null,78,"",null,null,null,"",null,null,null,null,null,null,""]
[null,79,"",null,null,null,"",null,null,null,null,null,null,""]
[null,80,"",null,null,null,"",null,null,null,null,null,null,""]
[null,81,"",null,null,null,"",null,null,null,null,null,null,""]
[null,82,"",null,null,null,"",null,null,null,null,null,null,""]
[null,83,"",null,null,null,"",null,null,null,null,null,null,""]
[null,84,"",null,null,null,"",null,null,null,null,null,null,""]
[null,85,"",null,null,null,"",null,null,null,null,null,null,""]
[null,86,"",null,null,null,"",null,null,null,null,null,null,""]
[null,87,"",null,null,null,"",null,null,null,null,null,null,""]
[null,88,"",null,null,null,"",null,null,null,null,null,null,""]
[null,89,"",null,null,null,"",null,null,null,null,null,null,""]
[null,90,"",null,null,null,"",null,null,null,null,null,null,""]
[null,91,"",null,null,null,"",null,null,null,null,null,null,""]
[null,92,"",null,null,null,"",null,null,null,null,null,null,""]
[null,93,"",null,null,null,"",null,null,null,null,null,null,""]
[null,94,"",null,null,null,"",null,null,null,null,null,null,""]
[null,95,"",null,null,null,"",null,null,null,null,null,null,""]
[null,96,"",null,null,null,"",null,null,null,null,null,null,""]
[null,97,"",null,null,null,"",null,null,null,null,null,null,""]
[null,98,"",null,null,null,"",null,null,null,null,null,null,""]
[null,99,"",null,null,null,"",null,null,null,null,null,null,""]
[null,100,"",null,null,null,"",null,null,null,null,null,null,""]
[null,101,"",null,null,null,"",null,null,null,null,null,null,""]
[null,102,"",null,null,null,"",null,null,null,null,null,null,""]
[null,103,"",null,null,null,"",null,null,null,null,null,null,""]
[null,104,"",null,null,null,"",null,null,null,null,null,null,""]
[null,105,"",null,null,null,"",null,null,null,null,null,null,""]
[null,106,"",null,null,null,"",null,null,null,null,null,null,""]
[null,107,"",null,null,null,"",null,null,null,null,null,null,""]
[null,108,"",null,null,null,"",null,null,null,null,null,null,""]
[null,109,"",null,null,null,"",null,null,null,null,null,null,""]
[null,110,"",null,null,null,"",null,null,null,null,null,null,""]
[null,111,"",null,null,null,"",null,null,null,null,null,null,""]
[null,112,"",null,null,null,"",null,null,null,null,null,null,""]
[null,113,"",null,null,null,"",null,null,null,null,null,null,""]
[null,114,"",null,null,null,"",null,null,null,null,null,null,""]
[null,115,"",null,null,null,"",null,null,null,null,null,null,""]
[null,116,"",null,null,null,"",null,null,null,null,null,null,""]
[null,117,"",null,null,null,"",null,null,null,null,null,null,""]
[null,118,"",null,null,null,"",null,null,null,null,null,null,""]
[null,119,"",null,null,null,"",null,null,null,null,null,null,""]
[null,120,"",null,null,null,"",null,null,null,null,null,null,""]
[null,121,"",null,null,null,"",null,null,null,null,null,null,""]
[null,122,"",null,null,null,"",null,null,null,null,null,null,""]
[null,123,"",null,null,null,"",null,null,null,null,null,null,""]
[null,124,"",null,null,null,"",null,null,null,null,null,null,""]
[null,125,"",null,null,null,"",null,null,null,null,null,null,""]
[null,126,"",null,null,null,"",null,null,null,null,null,null,""]
[null,127,"",null,null,null,"",null,null,null,null,null,null,""]
[null,128,"",null,null,null,"",null,null,null,null,null,null,""]
[null,129,"",null,null,null,"",null,null,null,null,null,null,""]
[null,130,"",null,null,null,"",null,null,null,null,null,null,""]
[null,131,"",null,null,null,"",null,null,null,null,null,null,""]
[null,132,"",null,null,null,"",null,null,null,null,null,null,""]
[null,133,"",null,null,null,"",null,null,null,null,null,null,""]
[null,134,"",null,null,null,"",null,null,null,null,null,null,""]
[null,135,"",null,null,null,"",null,null,null,null,null,null,""]
[null,136,"",null,null,null,"",null,null,null,null,null,null,""]
[null,137,"",null,null,null,"",null,null,null,null,null,null,""]
[null,138,"",null,null,null,"",null,null,null,null,null,null,""]
[null,139,"",null,null,null,"",null,null,null,null,null,null,""]
[null,140,"",null,null,null,"",null,null,null,null,null,null,""]
[null,141,"",null,null,null,"",null,null,null,null,null,null,""]
[null,142,"",null,null,null,"",null,null,null,null,null,null,""]
[null,143,"",null,null,null,"",null,null,null,null,null,null,""]
[null,144,"",null,null,null,"",null,null,null,null,null,null,""]

{"sheet":"About you ","index":4,"n_rows":123,"n_cols":18,"rows_kept":123,"cut":false,"hidden":false,"merged":[[21,2,23,7],[21,9,23,14],[94,2,96,14],[107,2,109,14],[122,2,128,14],[81,2,83,14],[33,2,35,14],[45,2,47,14],[51,2,53,14],[63,2,65,14],[69,2,71,14]]}
[]
[null,null,null,null,null,null,null,null,null,null,null,null,null,null,null,null,null,"Please select from drop down list"]
[null,null,null,null,null,null,null,null,null,null,null,null,null,null,null,null,null,"Project Manager"]
[null,null,null,null,null,null,null,null,null,null,null,null,null,null,null,null,null,"Project Support"]
[null,null,null,null,null,null,null,null,null,null,null,null,null,null,null,null,null,"Programme Manager"]
[null,null,null,null,null,null,null,null,null,null,null,null,null,null,null,null,null,"Administrative/Clerical Officer"]
[null,null,null,null,null,null,null,null,null,null,null,null,null,null,null,null,null,"Trainee/Junior Project Manager"]
[null,null,null,null,null,null,null,null,null,null,null,null,null,null,null,null,null,"Other"]
[null,null,null,null,null,null,null,null,null,null,null,null,null,null,null,null,null,"Please select from drop down list"]
[null,null,null,null,null,null,null,null,null,null,null,null,null,null,null,null,null,"BCP Council"]
[null,null,null,null,null,null,null,null,null,null,null,null,null,null,null,null,null,"Dorset Council"]
[null,null,null,null,null,null,null,null,null,null,null,null,null,null,null,null,null,"Dorset County Hospital"]
[null,null,null,null,null,null,null,null,null,null,null,null,null,null,null,null,null,"Dorset Healthcare"]
[null,null,null,null,null,null,null,null,null,null,null,null,null,null,null,null,null,"NHS Dorset"]
[null,null,null,null,null,null,null,null,null,null,null,null,null,null,null,null,null,"Public Health Dorset"]
[null,null,null,null,null,null,null,null,null,null,null,null,null,null,null,null,null,"SWASFT"]
[null,null,null,null,null,null,null,null,null,null,null,null,null,null,null,null,null,"UHD "]
[null,null,null,null,null,null,null,null,null,null,null,null,null,null,null,null,null,"Other"]
[]
[null,null,null,null,null,null,null,null,null,null,null,null,null,null,null,null,null,"Please select from drop down list"]
[null,null,null,null,null,null,null,null,null,null,null,null,null,null,null,null,null,"I am not actively looking to improve my competence within project management"]
[null,null,"First Name",null,null,null,null,null,null,"Last Name",null,null,null,null,null,null,null,"I am looking to improve my competence within my current role"]
[null,null,null,null,null,null,null,null,null,null,null,null,null,null,null,null,null,"I am looking to improve my competence in project management to apply to a higher level role"]
[null,null,null,null,null,null,null,null,null,null,null,null,null,null,null,null,null,"Please select from drop down list"]
[null,null,null,null,null,null,null,null,null,null,null,null,null,null,null,null,null,"Less than 6 months"]
[null,null,null,null,null,null,null,null,null,null,null,null,null,null,null,null,null,"6 months - 1 year"]
[null,null,null,null,null,null,null,null,null,null,null,null,null,null,null,null,null,"1 - 2 years"]
[null,null,null,null,null,null,null,null,null,null,null,null,null,null,null,null,null,"2 -3 years"]
[null,null,null,null,null,null,null,null,null,null,null,null,null,null,null,null,null,"3 - 4 years"]
[null,null,null,null,null,null,null,null,null,null,null,null,null,null,null,null,null,"4 + years"]
[null,null,null,null,null,null,null,null,null,null,null,null,null,null,null,null,null,"Please select from drop down list"]
[null,null,null,null,null,null,null,null,null,null,null,null,null,null,null,null,null,"Less than 6 months"]
[null,null,null,null,null,null,null,null,null,null,null,null,null,null,null,null,null,"6 months - 1 year"]
[null,null,"Enter your Email Address Here",null,null,null,null,null,null,null,null,null,null,null,null,null,null,"1 - 3 years"]
[null,null,null,null,null,null,null,null,null,null,null,null,null,null,null,null,null,"3 - 5 years"]
[null,null,null,null,null,null,null,null,null,null,null,null,null,null,null,null,null,"5 - 8 years"]
[null,null,null,null,null,null,null,null,null,null,null,null,null,null,null,null,null,"8+ years"]
[]
[]
[]
[]
[]
[]
[]
[]
[null,null,"Please Select From Drop Down List"]
[]
[]
[]
[]
[]
[]
[]
[]
[]
[]
[]
[]
[]
[]
[]
[]
[]
[null,null,"Please select from drop down list"]
[]
[]
[]
[]
[]
[]
[]
[]
[]
[]
[]
[]
[]
[]
[]
[]
[]
[null,null,"Please Select From Drop Down List"]
[]
[]
[]
[]
[]
[]
[]
[]
[]
[]
[]
[]
[null,null,"Please Select From Drop Down List"]
[]
[]
[]
[]
[]
[]
[]
[]
[]
[]
[]
[]
[null,null,"Please select from drop down list"]
[]
[]
[]
[]
[]
[]
[]
[]
[]
[]
[]
[]
[]
[]
[null,null,""]

{"sheet":"Leadership and team management","index":5,"n_rows":214,"n_cols":14,"rows_kept":214,"cut":false,"hidden":false,"merged":[[210,4,210,12],[211,4,211,12],[212,4,212,12],[213,4,213,12],[205,4,205,12],[206,4,206,12],[207,4,207,12],[208,4,208,12],[209,4,209,12],[28,7,28,14],[201,4,201,12],[202,4,202,12],[203,4,203,12],[204,4,204,12]]}
[]
[]
[]
[]
[]
[]
[]
[]
[]
[]
[]
[]
[]
[]
[]
[]
[]
[]
[]
[]
[]
[]
[]
[]
[]
[]
[]
[]
[]
[]
[]
[]
[]
[]
[]
[]
[]
[]
[]
[]
[]
[]
[]
[]
[]
[]
[]
[]
[]
[]
[]
[]
[]
[]
[]
[]
[]
[]
[]
[]
[]
[]
[]
[]
[]
[]
[]
[]
[]
[]
[]
[]
[]
[]
[]
[]
[]
[]
[]
[]
[]
[]
[]
[]
[]
[]
[]
[]
[]
[]
[]
[]
[]
[]
[]
[]
[]
[]
[]
[]
[]
[]
[]
[]
[]
[]
[]
[]
[]
[]
[]
[]
[]
[]
[]
[]
[]
[]
[]
[]
[]
[]
[]
[]
[]
[]
[]
[]
[]
[]
[]
[]
[]
[]
[]
[]
[]
[]
[]
[]
[]
[]
[]
[]
[]
[]
[]
[]
[]
[]
[]
[]
[]
[]
[]
[]
[]
[]
[]
[]
[]
[]
[]
[]
[]
[]
[]
[]
[]
[]
[]
[]
[]
[]
[]
[]
[]
[]
[]
[]
[]
[]
[]
[]
[]
[]
[]
[]
[]
[]
[]
[]
[]
[]
[]
[]
[]
[]
[]
[]
[]
[null,null,null,"ID","Action/Objective",null,null,null,null,null,null,null,null,"Date due"]
[null,null,null,1,"e.g. I will aim to provide constructive peer feedback on at least one occasion within the next four weeks",null,null,null,null,null,null,null,null,"2020-01-01"]
[null,null,null,2]
[null,null,null,3]
[null,null,null,4]
[null,null,null,5]
[null,null,null,6]
[null,null,null,7]
[null,null,null,8]
[null,null,null,9]
[null,null,null,10]
[null,null,null,11]
[null,null,null,12]

{"sheet":"Resources management","index":6,"n_rows":212,"n_cols":14,"rows_kept":212,"cut":false,"hidden":false,"merged":[[203,4,203,12],[28,7,28,14],[199,4,199,12],[200,4,200,12],[201,4,201,12],[202,4,202,12],[210,4,210,12],[211,4,211,12],[204,4,204,12],[205,4,205,12],[206,4,206,12],[207,4,207,12],[208,4,208,12],[209,4,209,12]]}
[]
[]
[]
[]
[]
[]
[]
[]
[]
[]
[]
[]
[]
[]
[]
[]
[]
[]
[]
[]
[]
[]
[]
[]
[]
[]
[]
[]
[]
[]
[]
[]
[]
[]
[]
[]
[]
[]
[]
[]
[]
[]
[]
[]
[]
[]
[]
[]
[]
[]
[]
[]
[]
[]
[]
[]
[]
[]
[]
[]
[]
[]
[]
[]
[]
[]
[]
[]
[]
[]
[]
[]
[]
[]
[]
[]
[]
[]
[]
[]
[]
[]
[]
[]
[]
[]
[]
[]
[]
[]
[]
[]
[]
[]
[]
[]
[]
[]
[]
[]
[]
[]
[]
[]
[]
[]
[]
[]
[]
[]
[]
[]
[]
[]
[]
[]
[]
[]
[]
[]
[]
[]
[]
[]
[]
[]
[]
[]
[]
[]
[]
[]
[]
[]
[]
[]
[]
[]
[]
[]
[]
[]
[]
[]
[]
[]
[]
[]
[]
[]
[]
[]
[]
[]
[]
[]
[]
[]
[]
[]
[]
[]
[]
[]
[]
[]
[]
[]
[]
[]
[]
[]
[]
[]
[]
[]
[]
[]
[]
[]
[]
[]
[]
[]
[]
[]
[]
[]
[]
[]
[]
[]
[]
[]
[]
[]
[]
[]
[]
[null,null,null,"ID","Action/Objective",null,null,null,null,null,null,null,null,"Date due"]
[null,null,null,1]
[null,null,null,2]
[null,null,null,3]
[null,null,null,4]
[null,null,null,5]
[null,null,null,6]
[null,null,null,7]
[null,null,null,8]
[null,null,null,9]
[null,null,null,10]
[null,null,null,11]
[null,null,null,12]

{"sheet":"Professionalism","index":7,"n_rows":207,"n_cols":14,"rows_kept":207,"cut":false,"hidden":false,"merged":[[198,4,198,12],[28,7,28,14],[194,4,194,12],[195,4,195,12],[196,4,196,12],[197,4,197,12],[205,4,205,12],[206,4,206,12],[199,4,199,12],[200,4,200,12],[201,4,201,12],[202,4,202,12],[203,4,203,12],[204,4,204,12]]}
[]
[]
[]
[]
[]
[]
[]
[]
[]
[]
[]
[]
[]
[]
[]
[]
[]
[]
[]
[]
[]
[]
[]
[]
[]
[]
[]
[]
[]
[]
[]
[]
[]
[]
[]
[]
[]
[]
[]
[]
[]
[]
[]
[]
[]
[]
[]
[]
[]
[]
[]
[]
[]
[]
[]
[]
[]
[]
[]
[]
[]
[]
[]
[]
[]
[]
[]
[]
[]
[]
[]
[]
[]
[]
[]
[]
[]
[]
[]
[]
[]
[]
[]
[]
[]
[]
[]
[]
[]
[]
[]
[]
[]
[]
[]
[]
[]
[]
[]
[]
[]
[]
[]
[]
[]
[]
[]
[]
[]
[]
[]
[]
[]
[]
[]
[]
[]
[]
[]
[]
[]
[]
[]
[]
[]
[]
[]
[]
[]
[]
[]
[]
[]
[]
[]
[]
[]
[]
[]
[]
[]
[]
[]
[]
[]
[]
[]
[]
[]
[]
[]
[]
[]
[]
[]
[]
[]
[]
[]
[]
[]
[]
[]
[]
[]
[]
[]
[]
[]
[]
[]
[]
[]
[]
[]
[]
[]
[]
[]
[]
[]
[]
[]
[]
[]
[]
[]
[]
[]
[]
[]
[]
[]
[]
[null,null,null,"ID","Action/Objective",null,null,null,null,null,null,null,null,"Date due"]
[null,null,null,1]
[null,null,null,2]
[null,null,null,3]
[null,null,null,4]
[null,null,null,5]
[null,null,null,6]
[null,null,null,7]
[null,null,null,8]
[null,null,null,9]
[null,null,null,10]
[null,null,null,11]
[null,null,null,12]

{"sheet":"Project delivery","index":8,"n_rows":220,"n_cols":14,"rows_kept":220,"cut":false,"hidden":false,"merged":[[211,4,211,12],[28,7,28,14],[207,4,207,12],[208,4,208,12],[209,4,209,12],[210,4,210,12],[218,4,218,12],[219,4,219,12],[212,4,212,12],[213,4,213,12],[214,4,214,12],[215,4,215,12],[216,4,216,12],[217,4,217,12]]}
[]
[]
[]
[]
[]
[]
[]
[]
[]
[]
[]
[]
[]
[]
[]
[]
[]
[]
[]
[]
[]
[]
[]
[]
[]
[]
[]
[]
[]
[]
[]
[]
[]
[]
[]
[]
[]
[]
[]
[]
[]
[]
[]
[]
[]
[]
[]
[]
[]
[]
[]
[]
[]
[]
[]
[]
[]
[]
[]
[]
[]
[]
[]
[]
[]
[]
[]
[]
[]
[]
[]
[]
[]
[]
[]
[]
[]
[]
[]
[]
[]
[]
[]
[]
[]
[]
[]
[]
[]
[]
[]
[]
[]
[]
[]
[]
[]
[]
[]
[]
[]
[]
[]
[]
[]
[]
[]
[]
[]
[]
[]
[]
[]
[]
[]
[]
[]
[]
[]
[]
[]
[]
[]
[]
[]
[]
[]
[]
[]
[]
[]
[]
[]
[]
[]
[]
[]
[]
[]
[]
[]
[]
[]
[]
[]
[]
[]
[]
[]
[]
[]
[]
[]
[]
[]
[]
[]
[]
[]
[]
[]
[]
[]
[]
[]
[]
[]
[]
[]
[]
[]
[]
[]
[]
[]
[]
[]
[]
[]
[]
[]
[]
[]
[]
[]
[]
[]
[]
[]
[]
[]
[]
[]
[]
[]
[]
[]
[]
[]
[]
[]
[]
[]
[]
[]
[]
[]
[null,null,null,"ID","Action/Objective",null,null,null,null,null,null,null,null,"Date due"]
[null,null,null,1]
[null,null,null,2]
[null,null,null,3]
[null,null,null,4]
[null,null,null,5]
[null,null,null,6]
[null,null,null,7]
[null,null,null,8]
[null,null,null,9]
[null,null,null,10]
[null,null,null,11]
[null,null,null,12]

{"sheet":"Communication management","index":9,"n_rows":211,"n_cols":14,"rows_kept":211,"cut":false,"hidden":false,"merged":[[202,4,202,12],[28,7,28,14],[198,4,198,12],[199,4,199,12],[200,4,200,12],[201,4,201,12],[209,4,209,12],[210,4,210,12],[203,4,203,12],[204,4,204,12],[205,4,205,12],[206,4,206,12],[207,4,207,12],[208,4,208,12]]}
[]
[]
[]
[]
[]
[]
[]
[]
[]
[]
[]
[]
[]
[]
[]
[]
[]
[]
[]
[]
[]
[]
[]
[]
[]
[]
[]
[]
[]
[]
[]
[]
[]
[]
[]
[]
[]
[]
[]
[]
[]
[]
[]
[]
[]
[]
[]
[]
[]
[]
[]
[]
[]
[]
[]
[]
[]
[]
[]
[]
[]
[]
[]
[]
[]
[]
[]
[]
[]
[]
[]
[]
[]
[]
[]
[]
[]
[]
[]
[]
[]
[]
[]
[]
[]
[]
[]
[]
[]
[]
[]
[]
[]
[]
[]
[]
[]
[]
[]
[]
[]
[]
[]
[]
[]
[]
[]
[]
[]
[]
[]
[]
[]
[]
[]
[]
[]
[]
[]
[]
[]
[]
[]
[]
[]
[]
[]
[]
[]
[]
[]
[]
[]
[]
[]
[]
[]
[]
[]
[]
[]
[]
[]
[]
[]
[]
[]
[]
[]
[]
[]
[]
[]
[]
[]
[]
[]
[]
[]
[]
[]
[]
[]
[]
[]
[]
[]
[]
[]
[]
[]
[]
[]
[]
[]
[]
[]
[]
[]
[]
[]
[]
[]
[]
[]
[]
[]
[]
[]
[]
[]
[]
[]
[]
[]
[]
[]
[]
[null,null,null,"ID","Action/Objective",null,null,null,null,null,null,null,null,"Date due"]
[null,null,null,1]
[null,null,null,2]
[null,null,null,3]
[null,null,null,4]
[null,null,null,5]
[null,null,null,6]
[null,null,null,7]
[null,null,null,8]
[null,null,null,9]
[null,null,null,10]
[null,null,null,11]
[null,null,null,12]

{"sheet":"Conflict management","index":10,"n_rows":210,"n_cols":14,"rows_kept":210,"cut":false,"hidden":false,"merged":[[201,4,201,12],[28,7,28,14],[197,4,197,12],[198,4,198,12],[199,4,199,12],[200,4,200,12],[208,4,208,12],[209,4,209,12],[202,4,202,12],[203,4,203,12],[204,4,204,12],[205,4,205,12],[206,4,206,12],[207,4,207,12]]}
[]
[]
[]
[]
[]
[]
[]
[]
[]
[]
[]
[]
[]
[]
[]
[]
[]
[]
[]
[]
[]
[]
[]
[]
[]
[]
[]
[]
[]
[]
[]
[]
[]
[]
[]
[]
[]
[]
[]
[]
[]
[]
[]
[]
[]
[]
[]
[]
[]
[]
[]
[]
[]
[]
[]
[]
[]
[]
[]
[]
[]
[]
[]
[]
[]
[]
[]
[]
[]
[]
[]
[]
[]
[]
[]
[]
[]
[]
[]
[]
[]
[]
[]
[]
[]
[]
[]
[]
[]
[]
[]
[]
[]
[]
[]
[]
[]
[]
[]
[]
[]
[]
[]
[]
[]
[]
[]
[]
[]
[]
[]
[]
[]
[]
[]
[]
[]
[]
[]
[]
[]
[]
[]
[]
[]
[]
[]
[]
[]
[]
[]
[]
[]
[]
[]
[]
[]
[]
[]
[]
[]
[]
[]
[]
[]
[]
[]
[]
[]
[]
[]
[]
[]
[]
[]
[]
[]
[]
[]
[]
[]
[]
[]
[]
[]
[]
[]
[]
[]
[]
[]
[]
[]
[]
[]
[]
[]
[]
[]
[]
[]
[]
[]
[]
[]
[]
[]
[]
[]
[]
[]
[]
[]
[]
[]
[]
[]
[null,null,null,"ID","Action/Objective",null,null,null,null,null,null,null,null,"Date due"]
[null,null,null,1]
[null,null,null,2]
[null,null,null,3]
[null,null,null,4]
[null,null,null,5]
[null,null,null,6]
[null,null,null,7]
[null,null,null,8]
[null,null,null,9]
[null,null,null,10]
[null,null,null,11]
[null,null,null,12]

{"sheet":"Planning for success","index":11,"n_rows":214,"n_cols":14,"rows_kept":214,"cut":false,"hidden":false,"merged":[[205,4,205,12],[28,7,28,14],[201,4,201,12],[202,4,202,12],[203,4,203,12],[204,4,204,12],[212,4,212,12],[213,4,213,12],[206,4,206,12],[207,4,207,12],[208,4,208,12],[209,4,209,12],[210,4,210,12],[211,4,211,12]]}
[]
[]
[]
[]
[]
[]
[]
[]
[]
[]
[]
[]
[]
[]
[]
[]
[]
[]
[]
[]
[]
[]
[]
[]
[]
[]
[]
[]
[]
[]
[]
[]
[]
[]
[]
[]
[]
[]
[]
[]
[]
[]
[]
[]
[]
[]
[]
[]
[]
[]
[]
[]
[]
[]
[]
[]
[]
[]
[]
[]
[]
[]
[]
[]
[]
[]
[]
[]
[]
[]
[]
[]
[]
[]
[]
[]
[]
[]
[]
[]
[]
[]
[]
[]
[]
[]
[]
[]
[]
[]
[]
[]
[]
[]
[]
[]
[]
[]
[]
[]
[]
[]
[]
[]
[]
[]
[]
[]
[]
[]
[]
[]
[]
[]
[]
[]
[]
[]
[]
[]
[]
[]
[]
[]
[]
[]
[]
[]
[]
[]
[]
[]
[]
[]
[]
[]
[]
[]
[]
[]
[]
[]
[]
[]
[]
[]
[]
[]
[]
[]
[]
[]
[]
[]
[]
[]
[]
[]
[]
[]
[]
[]
[]
[]
[]
[]
[]
[]
[]
[]
[]
[]
[]
[]
[]
[]
[]
[]
[]
[]
[]
[]
[]
[]
[]
[]
[]
[]
[]
[]
[]
[]
[]
[]
[]
[]
[]
[]
[]
[]
[]
[null,null,null,"ID","Action/Objective",null,null,null,null,null,null,null,null,"Date due"]
[null,null,null,1]
[null,null,null,2]
[null,null,null,3]
[null,null,null,4]
[null,null,null,5]
[null,null,null,6]
[null,null,null,7]
[null,null,null,8]
[null,null,null,9]
[null,null,null,10]
[null,null,null,11]
[null,null,null,12]

{"sheet":"Scope management","index":12,"n_rows":206,"n_cols":14,"rows_kept":206,"cut":false,"hidden":false,"merged":[[197,4,197,12],[28,7,28,14],[193,4,193,12],[194,4,194,12],[195,4,195,12],[196,4,196,12],[204,4,204,12],[205,4,205,12],[198,4,198,12],[199,4,199,12],[200,4,200,12],[201,4,201,12],[202,4,202,12],[203,4,203,12]]}
[]
[]
[]
[]
[]
[]
[]
[]
[]
[]
[]
[]
[]
[]
[]
[]
[]
[]
[]
[]
[]
[]
[]
[]
[]
[]
[]
[]
[]
[]
[]
[]
[]
[]
[]
[]
[]
[]
[]
[]
[]
[]
[]
[]
[]
[]
[]
[]
[]
[]
[]
[]
[]
[]
[]
[]
[]
[]
[]
[]
[]
[]
[]
[]
[]
[]
[]
[]
[]
[]
[]
[]
[]
[]
[]
[]
[]
[]
[]
[]
[]
[]
[]
[]
[]
[]
[]
[]
[]
[]
[]
[]
[]
[]
[]
[]
[]
[]
[]
[]
[]
[]
[]
[]
[]
[]
[]
[]
[]
[]
[]
[]
[]
[]
[]
[]
[]
[]
[]
[]
[]
[]
[]
[]
[]
[]
[]
[]
[]
[]
[]
[]
[]
[]
[]
[]
[]
[]
[]
[]
[]
[]
[]
[]
[]
[]
[]
[]
[]
[]
[]
[]
[]
[]
[]
[]
[]
[]
[]
[]
[]
[]
[]
[]
[]
[]
[]
[]
[]
[]
[]
[]
[]
[]
[]
[]
[]
[]
[]
[]
[]
[]
[]
[]
[]
[]
[]
[]
[]
[]
[]
[]
[]
[null,null,null,"ID","Action/Objective",null,null,null,null,null,null,null,null,"Date due"]
[null,null,null,1]
[null,null,null,2]
[null,null,null,3]
[null,null,null,4]
[null,null,null,5]
[null,null,null,6]
[null,null,null,7]
[null,null,null,8]
[null,null,null,9]
[null,null,null,10]
[null,null,null,11]
[null,null,null,12]

{"sheet":"Risk and issue management","index":13,"n_rows":217,"n_cols":14,"rows_kept":217,"cut":false,"hidden":false,"merged":[[208,4,208,12],[28,7,28,14],[204,4,204,12],[205,4,205,12],[206,4,206,12],[207,4,207,12],[215,4,215,12],[216,4,216,12],[209,4,209,12],[210,4,210,12],[211,4,211,12],[212,4,212,12],[213,4,213,12],[214,4,214,12]]}
[]
[]
[]
[]
[]
[]
[]
[]
[]
[]
[]
[]
[]
[]
[]
[]
[]
[]
[]
[]
[]
[]
[]
[]
[]
[]
[]
[]
[]
[]
[]
[]
[]
[]
[]
[]
[]
[]
[]
[]
[]
[]
[]
[]
[]
[]
[]
[]
[]
[]
[]
[]
[]
[]
[]
[]
[]
[]
[]
[]
[]
[]
[]
[]
[]
[]
[]
[]
[]
[]
[]
[]
[]
[]
[]
[]
[]
[]
[]
[]
[]
[]
[]
[]
[]
[]
[]
[]
[]
[]
[]
[]
[]
[]
[]
[]
[]
[]
[]
[]
[]
[]
[]
[]
[]
[]
[]
[]
[]
[]
[]
[]
[]
[]
[]
[]
[]
[]
[]
[]
[]
[]
[]
[]
[]
[]
[]
[]
[]
[]
[]
[]
[]
[]
[]
[]
[]
[]
[]
[]
[]
[]
[]
[]
[]
[]
[]
[]
[]
[]
[]
[]
[]
[]
[]
[]
[]
[]
[]
[]
[]
[]
[]
[]
[]
[]
[]
[]
[]
[]
[]
[]
[]
[]
[]
[]
[]
[]
[]
[]
[]
[]
[]
[]
[]
[]
[]
[]
[]
[]
[]
[]
[]
[]
[]
[]
[]
[]
[]
[]
[]
[]
[]
[]
[null,null,null,"ID","Action/Objective",null,null,null,null,null,null,null,null,"Date due"]
[null,null,null,1]
[null,null,null,2]
[null,null,null,3]
[null,null,null,4]
[null,null,null,5]
[null,null,null,6]
[null,null,null,7]
[null,null,null,8]
[null,null,null,9]
[null,null,null,10]
[null,null,null,11]
[null,null,null,12]

{"sheet":"Project finances","index":14,"n_rows":208,"n_cols":14,"rows_kept":208,"cut":false,"hidden":false,"merged":[[199,4,199,12],[28,7,28,14],[195,4,195,12],[196,4,196,12],[197,4,197,12],[198,4,198,12],[206,4,206,12],[207,4,207,12],[200,4,200,12],[201,4,201,12],[202,4,202,12],[203,4,203,12],[204,4,204,12],[205,4,205,12]]}
[]
[]
[]
[]
[]
[]
[]
[]
[]
[]
[]
[]
[]
[]
[]
[]
[]
[]
[]
[]
[]
[]
[]
[]
[]
[]
[]
[]
[]
[]
[]
[]
[]
[]
[]
[]
[]
[]
[]
[]
[]
[]
[]
[]
[]
[]
[]
[]
[]
[]
[]
[]
[]
[]
[]
[]
[]
[]
[]
[]
[]
[]
[]
[]
[]
[]
[]
[]
[]
[]
[]
[]
[]
[]
[]
[]
[]
[]
[]
[]
[]
[]
[]
[]
[]
[]
[]
[]
[]
[]
[]
[]
[]
[]
[]
[]
[]
[]
[]
[]
[]
[]
[]
[]
[]
[]
[]
[]
[]
[]
[]
[]
[]
[]
[]
[]
[]
[]
[]
[]
[]
[]
[]
[]
[]
[]
[]
[]
[]
[]
[]
[]
[]
[]
[]
[]
[]
[]
[]
[]
[]
[]
[]
[]
[]
[]
[]
[]
[]
[]
[]
[]
[]
[]
[]
[]
[]
[]
[]
[]
[]
[]
[]
[]
[]
[]
[]
[]
[]
[]
[]
[]
[]
[]
[]
[]
[]
[]
[]
[]
[]
[]
[]
[]
[]
[]
[]
[]
[]
[]
[]
[]
[]
[]
[]
[null,null,null,"ID","Action/Objective",null,null,null,null,null,null,null,null,"Date due"]
[null,null,null,1]
[null,null,null,2]
[null,null,null,3]
[null,null,null,4]
[null,null,null,5]
[null,null,null,6]
[null,null,null,7]
[null,null,null,8]
[null,null,null,9]
[null,null,null,10]
[null,null,null,11]
[null,null,null,12]

{"sheet":"Project structure & governance","index":15,"n_rows":209,"n_cols":14,"rows_kept":209,"cut":false,"hidden":false,"merged":[[200,4,200,12],[28,7,28,14],[196,4,196,12],[197,4,197,12],[198,4,198,12],[199,4,199,12],[207,4,207,12],[208,4,208,12],[201,4,201,12],[202,4,202,12],[203,4,203,12],[204,4,204,12],[205,4,205,12],[206,4,206,12]]}
[]
[]
[]
[]
[]
[]
[]
[]
[]
[]
[]
[]
[]
[]
[]
[]
[]
[]
[]
[]
[]
[]
[]
[]
[]
[]
[]
[]
[]
[]
[]
[]
[]
[]
[]
[]
[]
[]
[]
[]
[]
[]
[]
[]
[]
[]
[]
[]
[]
[]
[]
[]
[]
[]
[]
[]
[]
[]
[]
[]
[]
[]
[]
[]
[]
[]
[]
[]
[]
[]
[]
[]
[]
[]
[]
[]
[]
[]
[]
[]
[]
[]
[]
[]
[]
[]
[]
[]
[]
[]
[]
[]
[]
[]
[]
[]
[]
[]
[]
[]
[]
[]
[]
[]
[]
[]
[]
[]
[]
[]
[]
[]
[]
[]
[]
[]
[]
[]
[]
[]
[]
[]
[]
[]
[]
[]
[]
[]
[]
[]
[]
[]
[]
[]
[]
[]
[]
[]
[]
[]
[]
[]
[]
[]
[]
[]
[]
[]
[]
[]
[]
[]
[]
[]
[]
[]
[]
[]
[]
[]
[]
[]
[]
[]
[]
[]
[]
[]
[]
[]
[]
[]
[]
[]
[]
[]
[]
[]
[]
[]
[]
[]
[]
[]
[]
[]
[]
[]
[]
[]
[]
[]
[]
[]
[]
[]
[null,null,null,"ID","Action/Objective",null,null,null,null,null,null,null,null,"Date due"]
[null,null,null,1]
[null,null,null,2]
[null,null,null,3]
[null,null,null,4]
[null,null,null,5]
[null,null,null,6]
[null,null,null,7]
[null,null,null,8]
[null,null,null,9]
[null,null,null,10]
[null,null,null,11]
[null,null,null,12]

{"sheet":"Quality","index":16,"n_rows":206,"n_cols":14,"rows_kept":206,"cut":false,"hidden":false,"merged":[[197,4,197,12],[28,7,28,14],[193,4,193,12],[194,4,194,12],[195,4,195,12],[196,4,196,12],[204,4,204,12],[205,4,205,12],[198,4,198,12],[199,4,199,12],[200,4,200,12],[201,4,201,12],[202,4,202,12],[203,4,203,12]]}
[]
[]
[]
[]
[]
[]
[]
[]
[]
[]
[]
[]
[]
[]
[]
[]
[]
[]
[]
[]
[]
[]
[]
[]
[]
[]
[]
[]
[]
[]
[]
[]
[]
[]
[]
[]
[]
[]
[]
[]
[]
[]
[]
[]
[]
[]
[]
[]
[]
[]
[]
[]
[]
[]
[]
[]
[]
[]
[]
[]
[]
[]
[]
[]
[]
[]
[]
[]
[]
[]
[]
[]
[]
[]
[]
[]
[]
[]
[]
[]
[]
[]
[]
[]
[]
[]
[]
[]
[]
[]
[]
[]
[]
[]
[]
[]
[]
[]
[]
[]
[]
[]
[]
[]
[]
[]
[]
[]
[]
[]
[]
[]
[]
[]
[]
[]
[]
[]
[]
[]
[]
[]
[]
[]
[]
[]
[]
[]
[]
[]
[]
[]
[]
[]
[]
[]
[]
[]
[]
[]
[]
[]
[]
[]
[]
[]
[]
[]
[]
[]
[]
[]
[]
[]
[]
[]
[]
[]
[]
[]
[]
[]
[]
[]
[]
[]
[]
[]
[]
[]
[]
[]
[]
[]
[]
[]
[]
[]
[]
[]
[]
[]
[]
[]
[]
[]
[]
[]
[]
[]
[]
[]
[]
[null,null,null,"ID","Action/Objective",null,null,null,null,null,null,null,null,"Date due"]
[null,null,null,1]
[null,null,null,2]
[null,null,null,3]
[null,null,null,4]
[null,null,null,5]
[null,null,null,6]
[null,null,null,7]
[null,null,null,8]
[null,null,null,9]
[null,null,null,10]
[null,null,null,11]
[null,null,null,12]

{"sheet":"Glossary","index":17,"n_rows":0,"n_cols":0,"rows_kept":0,"cut":false,"hidden":false,"merged":[]}

{"sheet":"Reference","index":18,"n_rows":0,"n_cols":0,"rows_kept":0,"cut":false,"hidden":false,"merged":[]}